{"text_format":"1","workbook":"xlsx","n_sheets":11,"sheets":["General Overview","OVERALL RATING","FITMENT","N1 Fitment","AEB Car-to-Car","AEB Pedestrian","AEB Cyclist","LSS","SAS","OSM","Summary"],"not_rendered":{"charts":0,"images":3,"macros":1,"external_links":1,"defined_names":39,"comments":1,"pivot_tables":0},"unopened":[],"bounds":{"document_bytes":16777216,"sheet_cells":100000,"rows_first":2000,"rows_last":500,"rows_between":2000,"halvings":0,"cell_chars":16384,"cell_head_chars":4096},"cells_cut":0,"cells_raw":0,"read":"whole","date_system":"1900"}

{"sheet":"General Overview","index":0,"n_rows":22,"n_cols":24,"rows_kept":22,"cut":false,"hidden":false,"merged":[[13,2,13,4],[15,2,15,4],[19,2,19,3],[1,1,1,4],[2,2,2,4],[3,2,3,4],[7,2,7,4],[8,2,8,4],[12,2,12,4],[17,2,17,4],[18,2,18,4],[9,2,9,4],[11,2,11,4],[22,2,22,4],[16,2,16,4],[20,2,20,3],[21,2,21,3],[14,2,14,4]]}
[]
[3,"VEHICLE SPECIFICATION",null,null,null,"YEAR OF TEST",2021,null,null,null,null,null,null,null,null,null,null,null,null,null,null,null,null,"3 door hatchback"]
[null,"Make",null,null,null,"AEB Car-to-Car",null,null,null,null,null,null,null,null,null,null,null,null,null,null,null,null,null,"3 door wgon"]
[null,"Model",null,null,null,"AEB Pedestrian tests",null,null,null,null,null,null,null,null,null,null,null,null,null,null,null,null,null,"5 door wagon"]
[null,"Tested Variant",null,null,null,"AEB Cyclist tests"]
[null,"Chassis",null,null,null,"LSS tests"]
[null,"Type Approval",null,null,null,"SAS tests",null,null,null,null,null,null,null,null,null,null,null,null,null,null,null,null,null,"5 door SUV"]
[null,"VIN of test vehicle",null,null,null,"OSM test"]
[null,"Kerb weight (kg)"]
[null,"Gross Vehicle Weight(kg)",null,null,null,null,null,null,null,null,null,null,null,null,null,null,null,null,null,null,null,null,null,"3 door SUV"]
[null,"Maximum Payload"]
[null,"Test weight (kg)",null,null,null,null,null,null,null,null,null,null,null,null,null,null,null,null,null,null,null,null,null,"5 door MPV"]
[null,"Engine"]
[null,"Trim level"]
[null,"Safety Pack"]
[null,"Body Type"]
[null,"Generation"]
[null,"Hand of drive"]
[null,"Seat arrangement"]
[null,"front row"]
[null,"second row"]
[null,"third row"]

{"sheet":"OVERALL RATING","index":1,"n_rows":19,"n_cols":8,"rows_kept":19,"cut":false,"hidden":false,"merged":[[16,1,16,7],[17,1,17,7],[18,1,18,7],[19,1,19,7],[12,2,12,4],[12,5,12,7],[13,2,13,4],[13,5,13,7],[14,2,14,4],[14,5,14,7],[11,2,11,4],[11,5,11,7],[1,2,1,4],[3,2,3,4],[3,5,3,7],[4,2,4,4],[4,5,4,7]]}
[]
[null,null,{"$f":"CONCATENATE('General Overview'!C3:E3,\" \",'General Overview'!C4)","v":" "},null,null,{"$f":"IF(F14>=60,\"GOLD\",IF(F14>=40,\"SILVER\",IF(F14>=20,\"BRONZE\",\"NOT RECOMMENDED\")))","v":"NOT RECOMMENDED"}]
[]
[null,null,"FITMENT\n",null,null,"PERFORMANCE\n"]
[null,null,{"$f":"ROUND(C12,1)","v":0},null,null,{"$f":"ROUND(F12,1)","v":0}]
[null,30,"AEB Car-to-Car","best fitment",{"$f":"'N1 Fitment'!N34","v":"N/A"},"AEB Car-to-Car",{"$f":"'AEB Car-to-Car'!D76/4*B6","v":0},{"$f":"CONCATENATE(\"out of \",B6)","v":"out of 30"}]
[null,10,"AEB Pedestrian","best fitment",{"$f":"'N1 Fitment'!O34","v":"N/A"},"AEB Pedestrian",{"$f":"'AEB Pedestrian'!D99/6*B7","v":0},"out of 10"]
[null,10,"AEB Cyclist","best fitment",{"$f":"'N1 Fitment'!P34","v":"N/A"},"AEB Cyclist",{"$f":"'AEB Cyclist'!D54/6*B8","v":0},"out of 10"]
[null,20,"LSS","best fitment",{"$f":"'N1 Fitment'!AD34","v":"N/A"},"LSS",{"$f":"LSS!D90/4*B9","v":0},"out of 20"]
[null,15,"SAS","best fitment",{"$f":"'N1 Fitment'!AF34","v":"N/A"},"SAS",{"$f":"SAS!D48/3*B10","v":0},"out of 15"]
[null,15,"OSM","best fitment",{"$f":"'N1 Fitment'!AE34","v":"N/A"},"OSM",{"$f":"OSM!D20/3*B11","v":0},"out of 15"]
[null,"Total Score",null,null,null,{"$f":"SUM(G6:G11)","v":0}]
[null,"Max Points available",null,null,null,100]
[null,"Normalised Score",null,null,null,{"$f":"INT(F12/F13*100)","v":0}]
[null,"Weight",null,null,null,0.5]
[null,null,null,null,{"$f":"C14/100","v":0},null,null,{"$f":"F14/100","v":0}]
[null,"COMMENTS"]
["Verdict"]
["Comment"]

{"sheet":"FITMENT","index":2,"n_rows":47,"n_cols":7,"rows_kept":47,"cut":false,"hidden":true,"merged":[[1,3,3,5],[1,1,3,2],[24,1,24,2],[35,1,35,2],[46,1,46,2],[13,1,13,2]]}
[]
[null,"FITMENT"]
[]
[]
[null,"AEB FITMENT",null,"AEB CAR-TO-CAR","AEB PEDESTRIAN","AEB CYCLIST","AEB"]
[null,null,"France",null,null,null,{"$f":"IF(COUNTIF(D6:F6,\"Standard\")>0,\"Standard\",IF(COUNTIF(D6:F6,\"Optional\")>0,\"Optional\",\"N/A\"))","v":"N/A"}]
[null,null,"Germany",null,null,null,{"$f":"IF(COUNTIF(D7:F7,\"Standard\")>0,\"Standard\",IF(COUNTIF(D7:F7,\"Optional\")>0,\"Optional\",\"N/A\"))","v":"N/A"}]
[null,null,"Italy",null,null,null,"N/A"]
[null,null,"Luxembourg",null,null,null,"N/A"]
[null,null,"Spain",null,null,null,"N/A"]
[null,null,"Sweden",null,null,null,"N/A"]
[null,null,"The Netherlands",null,null,null,"N/A"]
[null,null,"United Kingdom",null,null,null,"N/A"]
[null,"AEB FITMENT SUMMARY",null,{"$f":"IF(COUNTIF(D6:D13,\"Standard\")>0,\"Standard\",IF(COUNTIF(D6:D13,\"Optional\")>0,\"Optional\",\"N/A\"))","v":"N/A"},{"$f":"IF(COUNTIF(E6:E13,\"Standard\")>0,\"Standard\",IF(COUNTIF(E6:E13,\"Optional\")>0,\"Optional\",\"N/A\"))","v":"N/A"},{"$f":"IF(COUNTIF(F6:F13,\"Standard\")>0,\"Standard\",IF(COUNTIF(F6:F13,\"Optional\")>0,\"Optional\",\"N/A\"))","v":"N/A"},{"$f":"IF(COUNTIF(G6:G13,\"Standard\")>0,\"Standard\",IF(COUNTIF(G6:G13,\"Optional\")>0,\"Optional\",\"N/A\"))","v":"N/A"}]
[]
[null,"LSS FITMENT",null,"ELK/LKA","LDW","BLIS","LSS"]
[null,null,"France",null,null,null,{"$f":"IF(COUNTIF(D17:F17,\"Standard\")>0,\"Standard\",IF(COUNTIF(D17:F17,\"Optional\")>0,\"Optional\",\"N/A\"))","v":"N/A"}]
[null,null,"Germany",null,null,null,{"$f":"IF(COUNTIF(D18:F18,\"Standard\")>0,\"Standard\",IF(COUNTIF(D18:F18,\"Optional\")>0,\"Optional\",\"N/A\"))","v":"N/A"}]
[null,null,"Italy",null,null,null,"N/A"]
[null,null,"Luxembourg",null,null,null,"N/A"]
[null,null,"Spain",null,null,null,"N/A"]
[null,null,"Sweden",null,null,null,"N/A"]
[null,null,"The Netherlands",null,null,null,"N/A"]
[null,null,"United Kingdom",null,null,null,"N/A"]
[null,"LSS FITMENT SUMMARY",null,{"$f":"IF(COUNTIF(D17:D24,\"Standard\")>0,\"Standard\",IF(COUNTIF(D17:D24,\"Optional\")>0,\"Optional\",\"N/A\"))","v":"N/A"},{"$f":"IF(COUNTIF(E17:E24,\"Standard\")>0,\"Standard\",IF(COUNTIF(E17:E24,\"Optional\")>0,\"Optional\",\"N/A\"))","v":"N/A"},{"$f":"IF(COUNTIF(F17:F24,\"Standard\")>0,\"Standard\",IF(COUNTIF(F17:F24,\"Optional\")>0,\"Optional\",\"N/A\"))","v":"N/A"},{"$f":"IF(COUNTIF(G17:G24,\"Standard\")>0,\"Standard\",IF(COUNTIF(G17:G24,\"Optional\")>0,\"Optional\",\"N/A\"))","v":"N/A"}]
[]
[null,"SAS FITMENT",null,"SLIF","SCF",null,"SAS"]
[null,null,"France",null,null,null,{"$f":"IF(COUNTIF(D28:F28,\"Standard\")>0,\"Standard\",IF(COUNTIF(D28:F28,\"Optional\")>0,\"Optional\",\"N/A\"))","v":"N/A"}]
[null,null,"Germany",null,null,null,{"$f":"IF(COUNTIF(D29:F29,\"Standard\")>0,\"Standard\",IF(COUNTIF(D29:F29,\"Optional\")>0,\"Optional\",\"N/A\"))","v":"N/A"}]
[null,null,"Italy",null,null,null,"N/A"]
[null,null,"Luxembourg",null,null,null,"N/A"]
[null,null,"Spain",null,null,null,"N/A"]
[null,null,"Sweden",null,null,null,"N/A"]
[null,null,"The Netherlands",null,null,null,"N/A"]
[null,null,"United Kingdom",null,null,null,"N/A"]
[null,"SAS FITMENT SUMMARY",null,{"$f":"IF(COUNTIF(D28:D35,\"Standard\")>0,\"Standard\",IF(COUNTIF(D28:D35,\"Optional\")>0,\"Optional\",\"N/A\"))","v":"N/A"},{"$f":"IF(COUNTIF(E28:E35,\"Standard\")>0,\"Standard\",IF(COUNTIF(E28:E35,\"Optional\")>0,\"Optional\",\"N/A\"))","v":"N/A"},null,{"$f":"IF(COUNTIF(G28:G35,\"Standard\")>0,\"Standard\",IF(COUNTIF(G28:G35,\"Optional\")>0,\"Optional\",\"N/A\"))","v":"N/A"}]
[]
[null,"OSM FITMENT",null,"SBR - Driver","SBR - Passenger","Attention Assist","OSM"]
[null,null,"France",null,null,null,{"$f":"IF(COUNTIF(D39:F39,\"Standard\")>0,\"Standard\",IF(COUNTIF(D39:F39,\"Optional\")>0,\"Optional\",\"N/A\"))","v":"N/A"}]
[null,null,"Germany",null,null,null,{"$f":"IF(COUNTIF(D40:F40,\"Standard\")>0,\"Standard\",IF(COUNTIF(D40:F40,\"Optional\")>0,\"Optional\",\"N/A\"))","v":"N/A"}]
[null,null,"Italy",null,null,null,"N/A"]
[null,null,"Luxembourg",null,null,null,"N/A"]
[null,null,"Spain",null,null,null,"N/A"]
[null,null,"Sweden",null,null,null,"N/A"]
[null,null,"The Netherlands",null,null,null,"N/A"]
[null,null,"United Kingdom",null,null,null,"N/A"]
[null,"OSM FITMENT SUMMARY",null,{"$f":"IF(COUNTIF(D39:D46,\"Standard\")>0,\"Standard\",IF(COUNTIF(D39:D46,\"Optional\")>0,\"Optional\",\"N/A\"))","v":"N/A"},{"$f":"IF(COUNTIF(E39:E46,\"Standard\")>0,\"Standard\",IF(COUNTIF(E39:E46,\"Optional\")>0,\"Optional\",\"N/A\"))","v":"N/A"},{"$f":"IF(COUNTIF(F39:F46,\"Standard\")>0,\"Standard\",IF(COUNTIF(F39:F46,\"Optional\")>0,\"Optional\",\"N/A\"))","v":"N/A"},{"$f":"IF(COUNTIF(G39:G46,\"Standard\")>0,\"Standard\",IF(COUNTIF(G39:G46,\"Optional\")>0,\"Optional\",\"N/A\"))","v":"N/A"}]

{"sheet":"N1 Fitment","index":3,"n_rows":69,"n_cols":32,"rows_kept":69,"cut":false,"hidden":false,"merged":[[2,19,2,23],[2,24,2,25],[1,29,1,31],[1,1,3,1],[1,3,1,12],[1,13,1,25],[1,26,1,27],[2,3,2,4],[2,5,2,7],[2,8,2,10],[2,11,2,12],[2,13,2,15],[2,16,2,18]]}
[{"$f":"CONCATENATE('General Overview'!C3,\" \",'General Overview'!C4)","v":" "}]
["All N1 Variants","Country",null,"PASSIVE SAFETY",null,null,null,null,null,null,null,null,null,"ACTIVE SAFETY",null,null,null,null,null,null,null,null,null,null,null,null,"OTHER"]
[null,null,null,"Driver",null,"Centre",null,null,"Passenger",null,null,"Dr & Pass",null,"AEB",null,null,"Lane Support",null,null,"Occupant Status",null,null,null,null,"Speed Assistance",null,null,null,null,"LSS","OSM","SAS"]
[null,null,"CODE","Load-\nLimiter","Pre-\nTensioner","Airbag","Load-\nLimiter","Pre-\nTensioner","Airbag","Load-\nLimiter","Pre-\nTensioner","Side\nCurtain AB","Centre\nAirbag","Car-to-Car","Pedestrian","Cyclist","Lane Keep\nAssist","Lane Dep.\nWarning","Blind-spot\nInformation","Attention\nAssist","Direct Dr\nMonitoring","SBR\nDriver","SBR\nCentre","SBR\nPassenger","Speed\nLimiter","Speed Limit\nInformation","Alcolock\nInterface","AD Highway\nAssist","Comment","LSS","OSM","SAS"]
[null,null,null,1,2,3,4,5,6,7,8,9,10,11,12,13,14,15,16,17,18,19,20,21,22,23,24,25]
[null,"Austria","AT",null,null,null,null,null,null,null,null,null,null,null,null,null,null,null,null,null,null,null,null,null,null,null,null,null,null,{"$f":"IF(OR(Q6:S6=\"Std\"),\"Std\",IF(OR(Q6:S6=\"Opt1\",Q6:S6=\"Opt2\"),\"Opt\",\"N/A\"))","v":"N/A"},{"$f":"IF(OR(T6:X6=\"Std\"),\"Std\",IF(OR(T6:X6=\"Opt1\",T6:X6=\"Opt2\"),\"Opt\",\"N/A\"))","v":"N/A"},{"$f":"IF(OR(Y6:Z6=\"Std\"),\"Std\",IF(OR(Y6:Z6=\"Opt1\",Y6:Z6=\"Opt2\"),\"Opt\",\"N/A\"))","v":"N/A"}]
[null,"Belgium","BE",null,null,null,null,null,null,null,null,null,null,null,null,null,null,null,null,null,null,null,null,null,null,null,null,null,null,{"$f":"IF(OR(Q7:S7=\"Std\"),\"Std\",IF(OR(Q7:S7=\"Opt1\",Q7:S7=\"Opt2\"),\"Opt\",\"N/A\"))","v":"N/A"},{"$f":"IF(OR(T7:X7=\"Std\"),\"Std\",IF(OR(T7:X7=\"Opt1\",T7:X7=\"Opt2\"),\"Opt\",\"N/A\"))","v":"N/A"},{"$f":"IF(OR(Y7:Z7=\"Std\"),\"Std\",IF(OR(Y7:Z7=\"Opt1\",Y7:Z7=\"Opt2\"),\"Opt\",\"N/A\"))","v":"N/A"}]
[null,"Bulgaria","BG",null,null,null,null,null,null,null,null,null,null,null,null,null,null,null,null,null,null,null,null,null,null,null,null,null,null,{"$f":"IF(OR(Q8:S8=\"Std\"),\"Std\",IF(OR(Q8:S8=\"Opt1\",Q8:S8=\"Opt2\"),\"Opt\",\"N/A\"))","v":"N/A"},{"$f":"IF(OR(T8:X8=\"Std\"),\"Std\",IF(OR(T8:X8=\"Opt1\",T8:X8=\"Opt2\"),\"Opt\",\"N/A\"))","v":"N/A"},{"$f":"IF(OR(Y8:Z8=\"Std\"),\"Std\",IF(OR(Y8:Z8=\"Opt1\",Y8:Z8=\"Opt2\"),\"Opt\",\"N/A\"))","v":"N/A"}]
[null,"Croatia","HR",null,null,null,null,null,null,null,null,null,null,null,null,null,null,null,null,null,null,null,null,null,null,null,null,null,null,{"$f":"IF(OR(Q9:S9=\"Std\"),\"Std\",IF(OR(Q9:S9=\"Opt1\",Q9:S9=\"Opt2\"),\"Opt\",\"N/A\"))","v":"N/A"},{"$f":"IF(OR(T9:X9=\"Std\"),\"Std\",IF(OR(T9:X9=\"Opt1\",T9:X9=\"Opt2\"),\"Opt\",\"N/A\"))","v":"N/A"},{"$f":"IF(OR(Y9:Z9=\"Std\"),\"Std\",IF(OR(Y9:Z9=\"Opt1\",Y9:Z9=\"Opt2\"),\"Opt\",\"N/A\"))","v":"N/A"}]
[null,"Cyprus","CY",null,null,null,null,null,null,null,null,null,null,null,null,null,null,null,null,null,null,null,null,null,null,null,null,null,null,{"$f":"IF(OR(Q10:S10=\"Std\"),\"Std\",IF(OR(Q10:S10=\"Opt1\",Q10:S10=\"Opt2\"),\"Opt\",\"N/A\"))","v":"N/A"},{"$f":"IF(OR(T10:X10=\"Std\"),\"Std\",IF(OR(T10:X10=\"Opt1\",T10:X10=\"Opt2\"),\"Opt\",\"N/A\"))","v":"N/A"},{"$f":"IF(OR(Y10:Z10=\"Std\"),\"Std\",IF(OR(Y10:Z10=\"Opt1\",Y10:Z10=\"Opt2\"),\"Opt\",\"N/A\"))","v":"N/A"}]
[null,"Czech Republic","CZ",null,null,null,null,null,null,null,null,null,null,null,null,null,null,null,null,null,null,null,null,null,null,null,null,null,null,{"$f":"IF(OR(Q11:S11=\"Std\"),\"Std\",IF(OR(Q11:S11=\"Opt1\",Q11:S11=\"Opt2\"),\"Opt\",\"N/A\"))","v":"N/A"},{"$f":"IF(OR(T11:X11=\"Std\"),\"Std\",IF(OR(T11:X11=\"Opt1\",T11:X11=\"Opt2\"),\"Opt\",\"N/A\"))","v":"N/A"},{"$f":"IF(OR(Y11:Z11=\"Std\"),\"Std\",IF(OR(Y11:Z11=\"Opt1\",Y11:Z11=\"Opt2\"),\"Opt\",\"N/A\"))","v":"N/A"}]
[null,"Denmark","DK",null,null,null,null,null,null,null,null,null,null,null,null,null,null,null,null,null,null,null,null,null,null,null,null,null,null,{"$f":"IF(OR(Q12:S12=\"Std\"),\"Std\",IF(OR(Q12:S12=\"Opt1\",Q12:S12=\"Opt2\"),\"Opt\",\"N/A\"))","v":"N/A"},{"$f":"IF(OR(T12:X12=\"Std\"),\"Std\",IF(OR(T12:X12=\"Opt1\",T12:X12=\"Opt2\"),\"Opt\",\"N/A\"))","v":"N/A"},{"$f":"IF(OR(Y12:Z12=\"Std\"),\"Std\",IF(OR(Y12:Z12=\"Opt1\",Y12:Z12=\"Opt2\"),\"Opt\",\"N/A\"))","v":"N/A"}]
[null,"Estonia","EE",null,null,null,null,null,null,null,null,null,null,null,null,null,null,null,null,null,null,null,null,null,null,null,null,null,null,{"$f":"IF(OR(Q13:S13=\"Std\"),\"Std\",IF(OR(Q13:S13=\"Opt1\",Q13:S13=\"Opt2\"),\"Opt\",\"N/A\"))","v":"N/A"},{"$f":"IF(OR(T13:X13=\"Std\"),\"Std\",IF(OR(T13:X13=\"Opt1\",T13:X13=\"Opt2\"),\"Opt\",\"N/A\"))","v":"N/A"},{"$f":"IF(OR(Y13:Z13=\"Std\"),\"Std\",IF(OR(Y13:Z13=\"Opt1\",Y13:Z13=\"Opt2\"),\"Opt\",\"N/A\"))","v":"N/A"}]
[null,"Finland","FI",null,null,null,null,null,null,null,null,null,null,null,null,null,null,null,null,null,null,null,null,null,null,null,null,null,null,{"$f":"IF(OR(Q14:S14=\"Std\"),\"Std\",IF(OR(Q14:S14=\"Opt1\",Q14:S14=\"Opt2\"),\"Opt\",\"N/A\"))","v":"N/A"},{"$f":"IF(OR(T14:X14=\"Std\"),\"Std\",IF(OR(T14:X14=\"Opt1\",T14:X14=\"Opt2\"),\"Opt\",\"N/A\"))","v":"N/A"},{"$f":"IF(OR(Y14:Z14=\"Std\"),\"Std\",IF(OR(Y14:Z14=\"Opt1\",Y14:Z14=\"Opt2\"),\"Opt\",\"N/A\"))","v":"N/A"}]
[null,"France","FR",null,null,null,null,null,null,null,null,null,null,null,null,null,null,null,null,null,null,null,null,null,null,null,null,null,null,{"$f":"IF(OR(Q15:S15=\"Std\"),\"Std\",IF(OR(Q15:S15=\"Opt1\",Q15:S15=\"Opt2\"),\"Opt\",\"N/A\"))","v":"N/A"},{"$f":"IF(OR(T15:X15=\"Std\"),\"Std\",IF(OR(T15:X15=\"Opt1\",T15:X15=\"Opt2\"),\"Opt\",\"N/A\"))","v":"N/A"},{"$f":"IF(OR(Y15:Z15=\"Std\"),\"Std\",IF(OR(Y15:Z15=\"Opt1\",Y15:Z15=\"Opt2\"),\"Opt\",\"N/A\"))","v":"N/A"}]
[null,"Germany","DE",null,null,null,null,null,null,null,null,null,null,null,null,null,null,null,null,null,null,null,null,null,null,null,null,null,null,{"$f":"IF(OR(Q16:S16=\"Std\"),\"Std\",IF(OR(Q16:S16=\"Opt1\",Q16:S16=\"Opt2\"),\"Opt\",\"N/A\"))","v":"N/A"},{"$f":"IF(OR(T16:X16=\"Std\"),\"Std\",IF(OR(T16:X16=\"Opt1\",T16:X16=\"Opt2\"),\"Opt\",\"N/A\"))","v":"N/A"},{"$f":"IF(OR(Y16:Z16=\"Std\"),\"Std\",IF(OR(Y16:Z16=\"Opt1\",Y16:Z16=\"Opt2\"),\"Opt\",\"N/A\"))","v":"N/A"}]
[null,"Greece","GR",null,null,null,null,null,null,null,null,null,null,null,null,null,null,null,null,null,null,null,null,null,null,null,null,null,null,{"$f":"IF(OR(Q17:S17=\"Std\"),\"Std\",IF(OR(Q17:S17=\"Opt1\",Q17:S17=\"Opt2\"),\"Opt\",\"N/A\"))","v":"N/A"},{"$f":"IF(OR(T17:X17=\"Std\"),\"Std\",IF(OR(T17:X17=\"Opt1\",T17:X17=\"Opt2\"),\"Opt\",\"N/A\"))","v":"N/A"},{"$f":"IF(OR(Y17:Z17=\"Std\"),\"Std\",IF(OR(Y17:Z17=\"Opt1\",Y17:Z17=\"Opt2\"),\"Opt\",\"N/A\"))","v":"N/A"}]
[null,"Hungary","HU",null,null,null,null,null,null,null,null,null,null,null,null,null,null,null,null,null,null,null,null,null,null,null,null,null,null,{"$f":"IF(OR(Q18:S18=\"Std\"),\"Std\",IF(OR(Q18:S18=\"Opt1\",Q18:S18=\"Opt2\"),\"Opt\",\"N/A\"))","v":"N/A"},{"$f":"IF(OR(T18:X18=\"Std\"),\"Std\",IF(OR(T18:X18=\"Opt1\",T18:X18=\"Opt2\"),\"Opt\",\"N/A\"))","v":"N/A"},{"$f":"IF(OR(Y18:Z18=\"Std\"),\"Std\",IF(OR(Y18:Z18=\"Opt1\",Y18:Z18=\"Opt2\"),\"Opt\",\"N/A\"))","v":"N/A"}]
[null,"Ireland","IE",null,null,null,null,null,null,null,null,null,null,null,null,null,null,null,null,null,null,null,null,null,null,null,null,null,null,{"$f":"IF(OR(Q19:S19=\"Std\"),\"Std\",IF(OR(Q19:S19=\"Opt1\",Q19:S19=\"Opt2\"),\"Opt\",\"N/A\"))","v":"N/A"},{"$f":"IF(OR(T19:X19=\"Std\"),\"Std\",IF(OR(T19:X19=\"Opt1\",T19:X19=\"Opt2\"),\"Opt\",\"N/A\"))","v":"N/A"},{"$f":"IF(OR(Y19:Z19=\"Std\"),\"Std\",IF(OR(Y19:Z19=\"Opt1\",Y19:Z19=\"Opt2\"),\"Opt\",\"N/A\"))","v":"N/A"}]
[null,"Italy","IT",null,null,null,null,null,null,null,null,null,null,null,null,null,null,null,null,null,null,null,null,null,null,null,null,null,null,{"$f":"IF(OR(Q20:S20=\"Std\"),\"Std\",IF(OR(Q20:S20=\"Opt1\",Q20:S20=\"Opt2\"),\"Opt\",\"N/A\"))","v":"N/A"},{"$f":"IF(OR(T20:X20=\"Std\"),\"Std\",IF(OR(T20:X20=\"Opt1\",T20:X20=\"Opt2\"),\"Opt\",\"N/A\"))","v":"N/A"},{"$f":"IF(OR(Y20:Z20=\"Std\"),\"Std\",IF(OR(Y20:Z20=\"Opt1\",Y20:Z20=\"Opt2\"),\"Opt\",\"N/A\"))","v":"N/A"}]
[null,"Latvia","LV",null,null,null,null,null,null,null,null,null,null,null,null,null,null,null,null,null,null,null,null,null,null,null,null,null,null,{"$f":"IF(OR(Q21:S21=\"Std\"),\"Std\",IF(OR(Q21:S21=\"Opt1\",Q21:S21=\"Opt2\"),\"Opt\",\"N/A\"))","v":"N/A"},{"$f":"IF(OR(T21:X21=\"Std\"),\"Std\",IF(OR(T21:X21=\"Opt1\",T21:X21=\"Opt2\"),\"Opt\",\"N/A\"))","v":"N/A"},{"$f":"IF(OR(Y21:Z21=\"Std\"),\"Std\",IF(OR(Y21:Z21=\"Opt1\",Y21:Z21=\"Opt2\"),\"Opt\",\"N/A\"))","v":"N/A"}]
[null,"Lithuania","LT",null,null,null,null,null,null,null,null,null,null,null,null,null,null,null,null,null,null,null,null,null,null,null,null,null,null,{"$f":"IF(OR(Q22:S22=\"Std\"),\"Std\",IF(OR(Q22:S22=\"Opt1\",Q22:S22=\"Opt2\"),\"Opt\",\"N/A\"))","v":"N/A"},{"$f":"IF(OR(T22:X22=\"Std\"),\"Std\",IF(OR(T22:X22=\"Opt1\",T22:X22=\"Opt2\"),\"Opt\",\"N/A\"))","v":"N/A"},{"$f":"IF(OR(Y22:Z22=\"Std\"),\"Std\",IF(OR(Y22:Z22=\"Opt1\",Y22:Z22=\"Opt2\"),\"Opt\",\"N/A\"))","v":"N/A"}]
[null,"Luxembourg","LU",null,null,null,null,null,null,null,null,null,null,null,null,null,null,null,null,null,null,null,null,null,null,null,null,null,null,{"$f":"IF(OR(Q23:S23=\"Std\"),\"Std\",IF(OR(Q23:S23=\"Opt1\",Q23:S23=\"Opt2\"),\"Opt\",\"N/A\"))","v":"N/A"},{"$f":"IF(OR(T23:X23=\"Std\"),\"Std\",IF(OR(T23:X23=\"Opt1\",T23:X23=\"Opt2\"),\"Opt\",\"N/A\"))","v":"N/A"},{"$f":"IF(OR(Y23:Z23=\"Std\"),\"Std\",IF(OR(Y23:Z23=\"Opt1\",Y23:Z23=\"Opt2\"),\"Opt\",\"N/A\"))","v":"N/A"}]
[null,"Malta","MT",null,null,null,null,null,null,null,null,null,null,null,null,null,null,null,null,null,null,null,null,null,null,null,null,null,null,{"$f":"IF(OR(Q24:S24=\"Std\"),\"Std\",IF(OR(Q24:S24=\"Opt1\",Q24:S24=\"Opt2\"),\"Opt\",\"N/A\"))","v":"N/A"},{"$f":"IF(OR(T24:X24=\"Std\"),\"Std\",IF(OR(T24:X24=\"Opt1\",T24:X24=\"Opt2\"),\"Opt\",\"N/A\"))","v":"N/A"},{"$f":"IF(OR(Y24:Z24=\"Std\"),\"Std\",IF(OR(Y24:Z24=\"Opt1\",Y24:Z24=\"Opt2\"),\"Opt\",\"N/A\"))","v":"N/A"}]
[null,"Netherlands","NL",null,null,null,null,null,null,null,null,null,null,null,null,null,null,null,null,null,null,null,null,null,null,null,null,null,null,{"$f":"IF(OR(Q25:S25=\"Std\"),\"Std\",IF(OR(Q25:S25=\"Opt1\",Q25:S25=\"Opt2\"),\"Opt\",\"N/A\"))","v":"N/A"},{"$f":"IF(OR(T25:X25=\"Std\"),\"Std\",IF(OR(T25:X25=\"Opt1\",T25:X25=\"Opt2\"),\"Opt\",\"N/A\"))","v":"N/A"},{"$f":"IF(OR(Y25:Z25=\"Std\"),\"Std\",IF(OR(Y25:Z25=\"Opt1\",Y25:Z25=\"Opt2\"),\"Opt\",\"N/A\"))","v":"N/A"}]
[null,"Poland","PL",null,null,null,null,null,null,null,null,null,null,null,null,null,null,null,null,null,null,null,null,null,null,null,null,null,null,{"$f":"IF(OR(Q26:S26=\"Std\"),\"Std\",IF(OR(Q26:S26=\"Opt1\",Q26:S26=\"Opt2\"),\"Opt\",\"N/A\"))","v":"N/A"},{"$f":"IF(OR(T26:X26=\"Std\"),\"Std\",IF(OR(T26:X26=\"Opt1\",T26:X26=\"Opt2\"),\"Opt\",\"N/A\"))","v":"N/A"},{"$f":"IF(OR(Y26:Z26=\"Std\"),\"Std\",IF(OR(Y26:Z26=\"Opt1\",Y26:Z26=\"Opt2\"),\"Opt\",\"N/A\"))","v":"N/A"}]
[null,"Portugal","PT",null,null,null,null,null,null,null,null,null,null,null,null,null,null,null,null,null,null,null,null,null,null,null,null,null,null,{"$f":"IF(OR(Q27:S27=\"Std\"),\"Std\",IF(OR(Q27:S27=\"Opt1\",Q27:S27=\"Opt2\"),\"Opt\",\"N/A\"))","v":"N/A"},{"$f":"IF(OR(T27:X27=\"Std\"),\"Std\",IF(OR(T27:X27=\"Opt1\",T27:X27=\"Opt2\"),\"Opt\",\"N/A\"))","v":"N/A"},{"$f":"IF(OR(Y27:Z27=\"Std\"),\"Std\",IF(OR(Y27:Z27=\"Opt1\",Y27:Z27=\"Opt2\"),\"Opt\",\"N/A\"))","v":"N/A"}]
[null,"Romania","RO",null,null,null,null,null,null,null,null,null,null,null,null,null,null,null,null,null,null,null,null,null,null,null,null,null,null,{"$f":"IF(OR(Q28:S28=\"Std\"),\"Std\",IF(OR(Q28:S28=\"Opt1\",Q28:S28=\"Opt2\"),\"Opt\",\"N/A\"))","v":"N/A"},{"$f":"IF(OR(T28:X28=\"Std\"),\"Std\",IF(OR(T28:X28=\"Opt1\",T28:X28=\"Opt2\"),\"Opt\",\"N/A\"))","v":"N/A"},{"$f":"IF(OR(Y28:Z28=\"Std\"),\"Std\",IF(OR(Y28:Z28=\"Opt1\",Y28:Z28=\"Opt2\"),\"Opt\",\"N/A\"))","v":"N/A"}]
[null,"Slovakia","SK",null,null,null,null,null,null,null,null,null,null,null,null,null,null,null,null,null,null,null,null,null,null,null,null,null,null,{"$f":"IF(OR(Q29:S29=\"Std\"),\"Std\",IF(OR(Q29:S29=\"Opt1\",Q29:S29=\"Opt2\"),\"Opt\",\"N/A\"))","v":"N/A"},{"$f":"IF(OR(T29:X29=\"Std\"),\"Std\",IF(OR(T29:X29=\"Opt1\",T29:X29=\"Opt2\"),\"Opt\",\"N/A\"))","v":"N/A"},{"$f":"IF(OR(Y29:Z29=\"Std\"),\"Std\",IF(OR(Y29:Z29=\"Opt1\",Y29:Z29=\"Opt2\"),\"Opt\",\"N/A\"))","v":"N/A"}]
[null,"Slovenia","SI",null,null,null,null,null,null,null,null,null,null,null,null,null,null,null,null,null,null,null,null,null,null,null,null,null,null,{"$f":"IF(OR(Q30:S30=\"Std\"),\"Std\",IF(OR(Q30:S30=\"Opt1\",Q30:S30=\"Opt2\"),\"Opt\",\"N/A\"))","v":"N/A"},{"$f":"IF(OR(T30:X30=\"Std\"),\"Std\",IF(OR(T30:X30=\"Opt1\",T30:X30=\"Opt2\"),\"Opt\",\"N/A\"))","v":"N/A"},{"$f":"IF(OR(Y30:Z30=\"Std\"),\"Std\",IF(OR(Y30:Z30=\"Opt1\",Y30:Z30=\"Opt2\"),\"Opt\",\"N/A\"))","v":"N/A"}]
[null,"Spain","ES",null,null,null,null,null,null,null,null,null,null,null,null,null,null,null,null,null,null,null,null,null,null,null,null,null,null,{"$f":"IF(OR(Q31:S31=\"Std\"),\"Std\",IF(OR(Q31:S31=\"Opt1\",Q31:S31=\"Opt2\"),\"Opt\",\"N/A\"))","v":"N/A"},{"$f":"IF(OR(T31:X31=\"Std\"),\"Std\",IF(OR(T31:X31=\"Opt1\",T31:X31=\"Opt2\"),\"Opt\",\"N/A\"))","v":"N/A"},{"$f":"IF(OR(Y31:Z31=\"Std\"),\"Std\",IF(OR(Y31:Z31=\"Opt1\",Y31:Z31=\"Opt2\"),\"Opt\",\"N/A\"))","v":"N/A"}]
[null,"Sweden","SE",null,null,null,null,null,null,null,null,null,null,null,null,null,null,null,null,null,null,null,null,null,null,null,null,null,null,{"$f":"IF(OR(Q32:S32=\"Std\"),\"Std\",IF(OR(Q32:S32=\"Opt1\",Q32:S32=\"Opt2\"),\"Opt\",\"N/A\"))","v":"N/A"},{"$f":"IF(OR(T32:X32=\"Std\"),\"Std\",IF(OR(T32:X32=\"Opt1\",T32:X32=\"Opt2\"),\"Opt\",\"N/A\"))","v":"N/A"},{"$f":"IF(OR(Y32:Z32=\"Std\"),\"Std\",IF(OR(Y32:Z32=\"Opt1\",Y32:Z32=\"Opt2\"),\"Opt\",\"N/A\"))","v":"N/A"}]
[null,"United Kingdom","GB",null,null,null,null,null,null,null,null,null,null,null,null,null,null,null,null,null,null,null,null,null,null,null,null,null,null,{"$f":"IF(OR(Q33:S33=\"Std\"),\"Std\",IF(OR(Q33:S33=\"Opt1\",Q33:S33=\"Opt2\"),\"Opt\",\"N/A\"))","v":"N/A"},{"$f":"IF(OR(T33:X33=\"Std\"),\"Std\",IF(OR(T33:X33=\"Opt1\",T33:X33=\"Opt2\"),\"Opt\",\"N/A\"))","v":"N/A"},{"$f":"IF(OR(Y33:Z33=\"Std\"),\"Std\",IF(OR(Y33:Z33=\"Opt1\",Y33:Z33=\"Opt2\"),\"Opt\",\"N/A\"))","v":"N/A"}]
[null,"Europe",null,{"$f":"IF(AND(D6:D33=\"Std\"),\"Std\",IF(OR(D6:D33=\"Opt1\",D6:D33=\"Opt2\"),\"Opt\",\"N/A\"))","v":"N/A"},{"$f":"IF(AND(E6:E33=\"Std\"),\"Std\",IF(OR(E6:E33=\"Opt1\",E6:E33=\"Opt2\"),\"Opt\",\"N/A\"))","v":"N/A"},{"$f":"IF(AND(F6:F33=\"Std\"),\"Std\",IF(OR(F6:F33=\"Opt1\",F6:F33=\"Opt2\"),\"Opt\",\"N/A\"))","v":"N/A"},{"$f":"IF(AND(G6:G33=\"Std\"),\"Std\",IF(OR(G6:G33=\"Opt1\",G6:G33=\"Opt2\"),\"Opt\",\"N/A\"))","v":"N/A"},{"$f":"IF(AND(H6:H33=\"Std\"),\"Std\",IF(OR(H6:H33=\"Opt1\",H6:H33=\"Opt2\"),\"Opt\",\"N/A\"))","v":"N/A"},{"$f":"IF(AND(I6:I33=\"Std\"),\"Std\",IF(OR(I6:I33=\"Opt1\",I6:I33=\"Opt2\"),\"Opt\",\"N/A\"))","v":"N/A"},{"$f":"IF(AND(J6:J33=\"Std\"),\"Std\",IF(OR(J6:J33=\"Opt1\",J6:J33=\"Opt2\"),\"Opt\",\"N/A\"))","v":"N/A"},{"$f":"IF(AND(K6:K33=\"Std\"),\"Std\",IF(OR(K6:K33=\"Opt1\",K6:K33=\"Opt2\"),\"Opt\",\"N/A\"))","v":"N/A"},{"$f":"IF(AND(L6:L33=\"Std\"),\"Std\",IF(OR(L6:L33=\"Opt1\",L6:L33=\"Opt2\"),\"Opt\",\"N/A\"))","v":"N/A"},{"$f":"IF(AND(M6:M33=\"Std\"),\"Std\",IF(OR(M6:M33=\"Opt1\",M6:M33=\"Opt2\"),\"Opt\",\"N/A\"))","v":"N/A"},{"$f":"IF(AND(N6:N33=\"Std\"),\"Std\",IF(OR(N6:N33=\"Opt1\",N6:N33=\"Opt2\"),\"Opt\",\"N/A\"))","v":"N/A"},{"$f":"IF(AND(O6:O33=\"Std\"),\"Std\",IF(OR(O6:O33=\"Opt1\",O6:O33=\"Opt2\"),\"Opt\",\"N/A\"))","v":"N/A"},{"$f":"IF(AND(P6:P33=\"Std\"),\"Std\",IF(OR(P6:P33=\"Opt1\",P6:P33=\"Opt2\"),\"Opt\",\"N/A\"))","v":"N/A"},{"$f":"IF(AND(Q6:Q33=\"Std\"),\"Std\",IF(OR(Q6:Q33=\"Opt1\",Q6:Q33=\"Opt2\"),\"Opt\",\"N/A\"))","v":"N/A"},{"$f":"IF(AND(R6:R33=\"Std\"),\"Std\",IF(OR(R6:R33=\"Opt1\",R6:R33=\"Opt2\"),\"Opt\",\"N/A\"))","v":"N/A"},{"$f":"IF(AND(S6:S33=\"Std\"),\"Std\",IF(OR(S6:S33=\"Opt1\",S6:S33=\"Opt2\"),\"Opt\",\"N/A\"))","v":"N/A"},{"$f":"IF(AND(T6:T33=\"Std\"),\"Std\",IF(OR(T6:T33=\"Opt1\",T6:T33=\"Opt2\"),\"Opt\",\"N/A\"))","v":"N/A"},{"$f":"IF(AND(U6:U33=\"Std\"),\"Std\",IF(OR(U6:U33=\"Opt1\",U6:U33=\"Opt2\"),\"Opt\",\"N/A\"))","v":"N/A"},{"$f":"IF(AND(V6:V33=\"Std\"),\"Std\",IF(OR(V6:V33=\"Opt1\",V6:V33=\"Opt2\"),\"Opt\",\"N/A\"))","v":"N/A"},{"$f":"IF(AND(W6:W33=\"Std\"),\"Std\",IF(OR(W6:W33=\"Opt1\",W6:W33=\"Opt2\"),\"Opt\",\"N/A\"))","v":"N/A"},{"$f":"IF(AND(X6:X33=\"Std\"),\"Std\",IF(OR(X6:X33=\"Opt1\",X6:X33=\"Opt2\"),\"Opt\",\"N/A\"))","v":"N/A"},{"$f":"IF(AND(Y6:Y33=\"Std\"),\"Std\",IF(OR(Y6:Y33=\"Opt1\",Y6:Y33=\"Opt2\"),\"Opt\",\"N/A\"))","v":"N/A"},{"$f":"IF(AND(Z6:Z33=\"Std\"),\"Std\",IF(OR(Z6:Z33=\"Opt1\",Z6:Z33=\"Opt2\"),\"Opt\",\"N/A\"))","v":"N/A"},{"$f":"IF(AND(AA6:AA33=\"Std\"),\"Std\",IF(OR(AA6:AA33=\"Opt1\",AA6:AA33=\"Opt2\"),\"Opt\",\"N/A\"))","v":"N/A"},{"$f":"IF(AND(AB6:AB33=\"Std\"),\"Std\",IF(OR(AB6:AB33=\"Opt1\",AB6:AB33=\"Opt2\"),\"Opt\",\"N/A\"))","v":"N/A"},null,{"$f":"IF(AND(AD6:AD33=\"Std\"),\"Std\",IF(OR(AD6:AD33=\"Opt\"),\"Opt\",\"N/A\"))","v":"N/A"},{"$f":"IF(AND(AE6:AE33=\"Std\"),\"Std\",IF(OR(AE6:AE33=\"Opt\"),\"Opt\",\"N/A\"))","v":"N/A"},{"$f":"IF(AND(AF6:AF33=\"Std\"),\"Std\",IF(OR(AF6:AF33=\"Opt\"),\"Opt\",\"N/A\"))","v":"N/A"}]
["Data should be provided for N1 variants only."]
["Std","Standard fitment on all N1 variants of the model range.  It is not possible to buy an N1 variant without this item of safety equipment"]
["Opt1",{"$f":"\"The equipment is not standard on all variants but is available at least as an option on all N1 variants of the \"&A1&\" model range\"","v":"The equipment is not standard on all variants but is available at least as an option on all N1 variants of the   model range"}]
["Opt2",{"$f":"\"The equipment is offered as an option on at least one N1 variant of the \"&A1&\" model range\"","v":"The equipment is offered as an option on at least one N1 variant of the   model range"}]
["N/A","This item of safety equipment is not available, either as standard or as an option, on any N1 variant in the model range"]
[]
[]
[null,null,"AT"]
[null,null,"BE"]
[null,null,"BG"]
[null,null,"HR"]
[null,null,"CY"]
[null,null,"CZ"]
[null,null,"DK"]
[null,null,"EE"]
[null,null,"FI"]
[null,null,"FR"]
[null,null,"DE"]
[null,null,"GR"]
[null,null,"HU"]
[null,null,"IE"]
[null,null,"IT"]
[null,null,"LV"]
[null,null,"LT"]
[null,null,"LU"]
[null,null,"MT"]
[null,null,"NL"]
[null,null,"PL"]
[null,null,"PT"]
[null,null,"RO"]
[null,null,"SK"]
[null,null,"SI"]
[null,null,"ES"]
[null,null,"SE"]
[null,null,"GB"]

{"sheet":"AEB Car-to-Car","index":4,"n_rows":76,"n_cols":13,"rows_kept":76,"cut":false,"hidden":false,"merged":[[16,1,16,2],[17,1,31,1],[17,8,17,12],[12,3,12,7],[12,8,12,12],[26,3,26,7],[27,3,27,7],[28,3,28,7],[29,3,29,7],[30,3,30,7],[31,3,31,7],[13,3,13,7],[13,8,13,12],[18,8,18,12],[19,8,19,12],[20,8,20,12],[3,1,3,2],[3,3,3,7],[3,8,3,12],[4,3,4,7],[4,8,4,12],[5,3,5,7],[5,8,5,12],[1,1,2,2],[14,1,14,2],[14,3,14,12],[1,3,1,7],[1,8,1,12],[2,3,2,7],[2,8,2,12],[10,3,10,7],[10,8,10,12],[11,3,11,7],[11,8,11,12],[6,3,6,7],[6,8,6,12],[7,3,7,7],[7,8,7,12],[8,3,8,7],[8,8,8,12],[46,1,46,2],[46,3,46,7],[46,8,46,12],[48,1,48,12],[49,1,49,2],[49,3,49,4],[49,5,49,7],[49,8,49,9],[49,10,49,12],[32,1,32,2],[32,3,32,7],[32,8,32,12],[34,1,34,2],[35,1,45,1],[35,8,35,12],[36,8,36,12],[37,8,37,12],[38,8,38,12],[56,1,56,2],[56,3,56,7],[56,8,56,12],[54,3,54,4],[54,5,54,7],[54,8,54,9],[54,10,54,12],[55,3,55,4],[55,5,55,7],[55,8,55,9],[55,10,55,12],[52,3,52,4],[52,5,52,7],[52,8,52,9],[52,10,52,12],[50,3,50,4],[50,5,50,7],[50,8,50,9],[53,3,53,7],[53,8,53,12],[50,10,50,12],[51,3,51,4],[51,5,51,7],[51,8,51,9],[51,10,51,12],[62,1,62,2],[62,3,62,12],[64,1,64,2],[64,3,64,7],[64,8,64,12],[65,3,65,7],[65,8,65,12],[58,3,58,12],[59,3,59,12],[60,3,60,4],[60,5,60,12],[61,3,61,4],[61,5,61,12],[73,3,73,12],[75,1,75,2],[75,3,75,12],[68,3,68,12],[70,1,70,2],[70,3,70,12],[71,3,71,12],[72,3,72,12],[66,3,66,7],[66,8,66,12],[67,3,67,7],[67,8,67,12]]}
[3]
[null,"AEB CAR-TO-CAR",null,"AEB",null,null,null,null,"FCW"]
[]
[null,"SYSTEM DETAILS"]
[null,null,"System name"]
[null,null,"AEB and/or FCW"]
[null,null,"Functionality"]
[null,null,"Speed range (km/h) - Minimum"]
[null,null,"Maximum"]
[]
[null,"PREREQUISITES"]
[null,null,"Default ON after every journey"]
[null,null,"Loud and Clear FCW"]
[null,null,"System switches off below 130 km/h"]
[null,"PREREQUISITES",null,{"$f":"IF(AND(D12=\"PASS\",D13=\"PASS\",D14=\"NO\",I12=\"PASS\",I13=\"PASS\",I14=\"NO\"),\"PASS\",\"FAIL\")","v":"FAIL"}]
[]
[null,"CCRs",null,-0.5,-0.75,1,0.75,0.5,-0.5,-0.75,1,0.75,0.5]
[null,"Test Speed",10]
[null,null,15]
[null,null,20]
[null,null,25]
[null,null,30]
[null,null,35]
[null,null,40]
[null,null,45]
[null,null,50]
[null,null,55]
[null,null,60]
[null,null,65]
[null,null,70]
[null,null,75]
[null,null,80]
[null,"Predicted CCRs score",null,0,null,null,null,null,0]
[]
[null,"CCRm",null,-0.5,-0.75,1,0.75,0.5,-0.5,-0.75,1,0.75,0.5]
[null,"Test Speed",30]
[null,null,35]
[null,null,40]
[null,null,45]
[null,null,50]
[null,null,55]
[null,null,60]
[null,null,65]
[null,null,70]
[null,null,75]
[null,null,80]
[null,"Predicted CCRm score",null,0,null,null,null,null,0]
[]
[null,"CCRb"]
[null,"Testpoints CCRb",null,"Impact Speed",null,"Points",null,null,"Impact Speed",null,"Points"]
[null,null,"12m headway"]
[null,null,"-2m/s² EVT acceleration",null,null,{"$f":"IF(D52=\"Green\",1,IF(D52=\"Yellow\",0.75,IF(D52=\"Orange\",0.5,IF(D52=\"Brown\",0.25,0))))","v":0},null,null,null,null,{"$f":"IF(I52=\"Green\",1,IF(I52=\"Yellow\",0.75,IF(I52=\"Orange\",0.5,IF(I52=\"Brown\",0.25,0))))","v":0}]
[null,null,"-6m/s² EVT acceleration",null,null,{"$f":"IF(D53=\"Green\",1,IF(D53=\"Yellow\",0.75,IF(D53=\"Orange\",0.5,IF(D53=\"Brown\",0.25,0))))","v":0},null,null,null,null,{"$f":"IF(I53=\"Green\",1,IF(I53=\"Yellow\",0.75,IF(I53=\"Orange\",0.5,IF(I53=\"Brown\",0.25,0))))","v":0}]
[null,null,"40m headway"]
[null,null,"-2m/s² EVT acceleration",null,null,{"$f":"IF(D55=\"Green\",1,IF(D55=\"Yellow\",0.75,IF(D55=\"Orange\",0.5,IF(D55=\"Brown\",0.25,0))))","v":0},null,null,null,null,{"$f":"IF(I55=\"Green\",1,IF(I55=\"Yellow\",0.75,IF(I55=\"Orange\",0.5,IF(I55=\"Brown\",0.25,0))))","v":0}]
[null,null,"-6m/s² EVT acceleration",null,null,{"$f":"IF(D56=\"Green\",1,IF(D56=\"Yellow\",0.75,IF(D56=\"Orange\",0.5,IF(D56=\"Brown\",0.25,0))))","v":0},null,null,null,null,{"$f":"IF(I56=\"Green\",1,IF(I56=\"Yellow\",0.75,IF(I56=\"Orange\",0.5,IF(I56=\"Brown\",0.25,0))))","v":0}]
[null,"CCRb RESULT",null,{"$f":"SUM(F52:H53,F55:H56)/4","v":0},null,null,null,null,{"$f":"SUM(K52:M53,K55:M56)/4","v":0}]
[]
[null,"HMI"]
[null,null,"Additional HMI features"]
[null,null,"Suplementary warning","NO",null,{"$f":"IF(D61=\"Yes\",1,0)","v":0}]
[null,null,"Restraint activation / dynamic retractors","NO",null,{"$f":"IF(D62=\"Yes\",1,0)","v":0}]
[null,"HMI RESULT",null,{"$f":"SUM(F61:M62)/2","v":0}]
[]
[null,"SUMMARY"]
[null,null,"CCRs (prediction x correction factor)",{"$f":"IF(COUNTIF(D18:H20,\"Green\")=15,D33,0)","v":0},null,null,null,null,{"$f":"MIN(I33,1)","v":0}]
[null,null,"CCRm (prediction x correction factor)",{"$f":"MIN(D47,1)","v":0},null,null,null,null,{"$f":"MIN(I47,1)","v":0}]
[null,null,"CCRb",{"$f":"D57","v":0},null,null,null,null,{"$f":"I57","v":0}]
[null,null,"HMI",{"$f":"D63","v":0}]
[]
[null,"TOTAL"]
[null,null,"AEB",{"$f":"ROUND(AVERAGE(D66:H68)*2,Round)","v":0}]
[null,null,"FCW",{"$f":"ROUND(AVERAGE(I66:M68)*1.5,Round)","v":0}]
[null,null,"HMI",{"$f":"D69*0.5","v":0}]
[]
[null,"TOTAL AEB CAR-TO-CAR",null,{"$f":"IF(D15=\"PASS\",SUM(D72:M74),0)","v":0}]

{"sheet":"AEB Pedestrian","index":5,"n_rows":99,"n_cols":5,"rows_kept":99,"cut":false,"hidden":false,"merged":[[92,3,92,4],[96,3,96,4],[98,1,98,2],[98,3,98,4],[93,3,93,4],[95,1,95,2],[95,3,95,4],[89,3,89,4],[90,3,90,4],[91,3,91,4],[86,1,86,2],[86,3,86,4],[88,1,88,2],[88,3,88,4],[66,3,66,4],[76,1,76,2],[76,3,76,4],[54,3,54,4],[64,1,64,2],[64,3,64,4],[52,1,52,2],[52,3,52,4],[40,1,40,2],[40,3,40,4],[42,3,42,4],[14,3,14,4],[30,3,30,4],[28,1,28,2],[28,3,28,4],[13,3,13,4],[16,1,16,2],[18,3,18,4],[15,3,15,4],[16,3,16,4],[6,3,6,4],[7,3,7,4],[8,3,8,4],[1,1,3,2],[12,3,12,4],[1,3,2,4],[11,3,11,4],[10,3,10,4],[4,3,4,4],[5,3,5,4]]}
[3]
[null,"AEB Pedestrian",null,"Daytime"]
[]
[null,null,null,"Vimpact","Points"]
[null,"SYSTEM DETAILS"]
[null,null,"System Name"]
[null,null,"Functionality"]
[null,null,"Speed range (km/h) - Minimum"]
[null,null,"Maximum"]
[]
[null,"PREREQUISITES"]
[]
[null,null,"Default ON"]
[null,null,"Can identify slower walking pedestrian (CPNA-75)"]
[null,null,"System active from speeds of 10 km/h (CPNA-75)"]
[null,null,"System switches off below 80 km/h"]
[null,"PREREQUISITES",null,{"$f":"IF(AND(D13=\"YES\",D14=\"PASS\",D15=\"PASS\",D16=\"NO\"),\"PASS\",\"FAIL\")","v":"FAIL"}]
[]
[null,"CPFA-50"]
[null,1,20,null,{"$f":"IF(D20=\"\",0,ROUND(($C20-IF(D20>$C20,$C20,D20))/$C20*1,Round))","v":0}]
[null,2,25,null,{"$f":"IF(D21=\"\",0,ROUND(($C21-IF(D21>$C21,$C21,D21))/$C21*1,Round))","v":0}]
[null,2,30,null,{"$f":"IF(D22=\"\",0,ROUND(($C22-IF(D22>$C22,$C22,D22))/$C22*2,Round))","v":0}]
[null,3,35,null,{"$f":"IF(D23=\"\",0,ROUND(($C23-IF(D23>$C23,$C23,D23))/$C23*3,Round))","v":0}]
[null,3,40,null,{"$f":"IF(D24=\"\",0,ROUND(($C24-IF(D24>$C24,$C24,D24))/$C24*3,Round))","v":0}]
[null,null,45,null,{"$f":"IF(D25=\"\",0,IF(D25<=(C25-20),3,0))","v":0}]
[null,null,50,null,{"$f":"IF(D26=\"\",0,IF(D26<=(C26-20),2,0))","v":0}]
[null,null,55,null,{"$f":"IF(D27=\"\",0,IF(D27<=(C27-20),2,0))","v":0}]
[null,null,60,null,{"$f":"IF(D28=\"\",0,IF(D28<=(C28-20),1,0))","v":0}]
[null,"CPFA-50 RESULT",null,{"$f":"SUM(E20:E24,E25:E28)","v":0}]
[]
[null,"CPNA-25"]
[null,1,20,null,{"$f":"IF(D32=\"\",0,ROUND(($C32-IF(D32>$C32,$C32,D32))/$C32*1,Round))","v":0}]
[null,2,25,null,{"$f":"IF(D33=\"\",0,ROUND(($C33-IF(D33>$C33,$C33,D33))/$C33*1,Round))","v":0}]
[null,2,30,null,{"$f":"IF(D34=\"\",0,ROUND(($C34-IF(D34>$C34,$C34,D34))/$C34*2,Round))","v":0}]
[null,3,35,null,{"$f":"IF(D35=\"\",0,ROUND(($C35-IF(D35>$C35,$C35,D35))/$C35*3,Round))","v":0}]
[null,3,40,null,{"$f":"IF(D36=\"\",0,ROUND(($C36-IF(D36>$C36,$C36,D36))/$C36*3,Round))","v":0}]
[null,null,45,null,{"$f":"IF(D37=\"\",0,IF(D37<=(C37-20),3,0))","v":0}]
[null,null,50,null,{"$f":"IF(D38=\"\",0,IF(D38<=(C38-20),2,0))","v":0}]
[null,null,55,null,{"$f":"IF(D39=\"\",0,IF(D39<=(C39-20),2,0))","v":0}]
[null,null,60,null,{"$f":"IF(D40=\"\",0,IF(D40<=(C40-20),1,0))","v":0}]
[null,"CPNA-25 RESULT",null,{"$f":"SUM(E32:E36,E37:E40)","v":0}]
[]
[null,"CPNA-75"]
[null,1,20,null,{"$f":"IF(D44=\"\",0,ROUND(($C44-IF(D44>$C44,$C44,D44))/$C44*1,Round))","v":0}]
[null,2,25,null,{"$f":"IF(D45=\"\",0,ROUND(($C45-IF(D45>$C45,$C45,D45))/$C45*1,Round))","v":0}]
[null,2,30,null,{"$f":"IF(D46=\"\",0,ROUND(($C46-IF(D46>$C46,$C46,D46))/$C46*2,Round))","v":0}]
[null,3,35,null,{"$f":"IF(D47=\"\",0,ROUND(($C47-IF(D47>$C47,$C47,D47))/$C47*3,Round))","v":0}]
[null,3,40,null,{"$f":"IF(D48=\"\",0,ROUND(($C48-IF(D48>$C48,$C48,D48))/$C48*3,Round))","v":0}]
[null,null,45,null,{"$f":"IF(D49=\"\",0,IF(D49<=(C49-20),3,0))","v":0}]
[null,null,50,null,{"$f":"IF(D50=\"\",0,IF(D50<=(C50-20),2,0))","v":0}]
[null,null,55,null,{"$f":"IF(D51=\"\",0,IF(D51<=(C51-20),2,0))","v":0}]
[null,null,60,null,{"$f":"IF(D52=\"\",0,IF(D52<=(C52-20),1,0))","v":0}]
[null,"CPNA-75 RESULT",null,{"$f":"SUM(E44:E48,E49:E52)","v":0}]
[]
[null,"CPNC-50"]
[null,1,20,null,{"$f":"IF(D56=\"\",0,ROUND(($C56-IF(D56>$C56,$C56,D56))/$C56*1,Round))","v":0}]
[null,2,25,null,{"$f":"IF(D57=\"\",0,ROUND(($C57-IF(D57>$C57,$C57,D57))/$C57*1,Round))","v":0}]
[null,2,30,null,{"$f":"IF(D58=\"\",0,ROUND(($C58-IF(D58>$C58,$C58,D58))/$C58*2,Round))","v":0}]
[null,3,35,null,{"$f":"IF(D59=\"\",0,ROUND(($C59-IF(D59>$C59,$C59,D59))/$C59*3,Round))","v":0}]
[null,3,40,null,{"$f":"IF(D60=\"\",0,ROUND(($C60-IF(D60>$C60,$C60,D60))/$C60*3,Round))","v":0}]
[null,null,45,null,{"$f":"IF(D61=\"\",0,IF(D61<=(C61-20),3,0))","v":0}]
[null,null,50,null,{"$f":"IF(D62=\"\",0,IF(D62<=(C62-20),2,0))","v":0}]
[null,null,55,null,{"$f":"IF(D63=\"\",0,IF(D63<=(C63-20),2,0))","v":0}]
[null,null,60,null,{"$f":"IF(D64=\"\",0,IF(D64<=(C64-20),1,0))","v":0}]
[null,"CPNC-50 RESULT",null,{"$f":"SUM(E56:E60,E61:E64)","v":0}]
[]
[null,"CPLA-50"]
[null,1,20,null,{"$f":"IF(D68=\"\",0,ROUND((($C68-5)-(IF(D68<=5,5,IF(D68>$C68,$C68,D68))-5))/($C68-5)*$B68,Round))","v":0}]
[null,1,25,null,{"$f":"IF(D69=\"\",0,ROUND((($C69-5)-(IF(D69<=5,5,IF(D69>$C69,$C69,D69))-5))/($C69-5)*$B69,Round))","v":0}]
[null,1,30,null,{"$f":"IF(D70=\"\",0,ROUND((($C70-5)-(IF(D70<=5,5,IF(D70>$C70,$C70,D70))-5))/($C70-5)*$B70,Round))","v":0}]
[null,2,35,null,{"$f":"IF(D71=\"\",0,ROUND((($C71-5)-(IF(D71<=5,5,IF(D71>$C71,$C71,D71))-5))/($C71-5)*$B71,Round))","v":0}]
[null,2,40,null,{"$f":"IF(D72=\"\",0,ROUND((($C72-5)-(IF(D72<=5,5,IF(D72>$C72,$C72,D72))-5))/($C72-5)*$B72,Round))","v":0}]
[null,3,45,null,{"$f":"IF(D73=\"\",0,IF(D73<=(C73-20),$B73,0))","v":0}]
[null,3,50,null,{"$f":"IF(D74=\"\",0,IF(D74<=(C74-20),$B74,0))","v":0}]
[null,3,55,null,0]
[null,2,60,null,0]
[null,"CPLA-50 RESULT",null,{"$f":"SUM(E68:E72,E73:E76)","v":0}]
[]
[null,"CPLA-25",null,"TTCFCW","Points"]
[null,3,50,null,{"$f":"IF(D80=\"\",0,IF(D80>=1.7,$B80,0))","v":0}]
[null,3,55,null,{"$f":"IF(D81=\"\",0,IF(D81>=1.7,$B81,0))","v":0}]
[null,2,60,null,0]
[null,1,65,null,0]
[null,1,70,null,0]
[null,1,75,null,0]
[null,1,80,null,0]
[null,"CPLA-25 RESULT",null,{"$f":"SUM(E80:E84,E85:E86)","v":0}]
[]
[null,"SUMMARY",null,"DAYTIME"]
[null,null,"CPFA-50",{"$f":"ROUND(D29/18,Round)","v":0}]
[null,null,"CPNA-25",{"$f":"ROUND(D41/18,Round)","v":0}]
[null,null,"CPNA-75",{"$f":"ROUND(D53/18,Round)","v":0}]
[null,null,"CPNC-50",{"$f":"ROUND(D65/18,Round)","v":0}]
[null,null,"CPLA",{"$f":"ROUND((D77+D87)/30,Round)","v":0}]
[]
[null,"TOTAL"]
[null,null,"Daytime",{"$f":"IF(D17=\"FAIL\",0,ROUND(AVERAGE(D90:E94)*6,Round))","v":0}]
[]
[null,"TOTAL AEB Pedestrian",null,{"$f":"ROUND(SUM(D97:E97),Round)","v":0}]

{"sheet":"AEB Cyclist","index":6,"n_rows":54,"n_cols":5,"rows_kept":54,"cut":false,"hidden":false,"merged":[[4,3,4,4],[5,3,5,4],[6,3,6,4],[7,3,7,4],[8,3,8,4],[53,1,53,2],[53,3,53,4],[52,3,52,4],[51,3,51,4],[49,1,49,2],[49,3,49,4],[50,3,50,4],[1,1,3,2],[26,1,26,2],[26,3,26,4],[37,3,37,4],[47,1,47,2],[28,3,28,4],[16,3,16,4],[37,1,37,2],[14,1,14,2],[14,3,14,4],[11,3,11,4],[47,3,47,4],[1,3,2,4],[12,3,12,4],[13,3,13,4],[10,3,10,4]]}
[3]
[null,"AEB Cyclist"]
[]
[null,null,null,"Vimpact","Points"]
[null,"SYSTEM DETAILS"]
[null,null,"System Name"]
[null,null,"Functionality"]
[null,null,"Speed range (km/h) - Minimum"]
[null,null,"Maximum"]
[]
[null,"PREREQUISITES"]
[]
[null,null,"Default ON"]
[null,null,"System switches off below 80 km/h"]
[null,"PREREQUISITES",null,{"$f":"IF(AND(D13=\"YES\",D14=\"NO\"),\"PASS\",\"FAIL\")","v":"FAIL"}]
[]
[null,"CBNA"]
[null,null,20,null,{"$f":"IF(D18=\"\",0,ROUND(($C18-IF(D18>$C18,$C18,D18))/$C18*1,Round))","v":0}]
[null,null,25,null,{"$f":"IF(D19=\"\",0,ROUND(($C19-IF(D19>$C19,$C19,D19))/$C19*1,Round))","v":0}]
[null,null,30,null,{"$f":"IF(D20=\"\",0,ROUND(($C20-IF(D20>$C20,$C20,D20))/$C20*1,Round))","v":0}]
[null,null,35,null,{"$f":"IF(D21=\"\",0,ROUND(($C21-IF(D21>$C21,$C21,D21))/$C21*1,Round))","v":0}]
[null,null,40,null,{"$f":"IF(D22=\"\",0,ROUND(($C22-IF(D22>$C22,$C22,D22))/$C22*1,Round))","v":0}]
[null,null,45,null,{"$f":"IF(D23=\"\",0,IF(D23<=(C23-20),1,0))","v":0}]
[null,null,50,null,{"$f":"IF(D24=\"\",0,IF(D24<=(C24-20),1,0))","v":0}]
[null,null,55,null,{"$f":"IF(D25=\"\",0,IF(D25<=(C25-20),1,0))","v":0}]
[null,null,60,null,{"$f":"IF(D26=\"\",0,IF(D26<=(C26-20),1,0))","v":0}]
[null,"CBNA-50 RESULT",null,{"$f":"SUM(E18:E22,E23:E26)","v":0}]
[]
[null,"CBLA-50"]
[null,1,25,null,{"$f":"IF(D30=\"\",0,ROUND((($C30-15)-(IF(D30<=15,15,IF(D30>$C30,$C30,D30))-15))/($C30-15)*$B30,Round))","v":0}]
[null,1,30,null,{"$f":"IF(D31=\"\",0,ROUND((($C31-15)-(IF(D31<=15,15,IF(D31>$C31,$C31,D31))-15))/($C31-15)*$B31,Round))","v":0}]
[null,2,35,null,{"$f":"IF(D32=\"\",0,ROUND((($C32-15)-(IF(D32<=15,15,IF(D32>$C32,$C32,D32))-15))/($C32-15)*$B32,Round))","v":0}]
[null,2,40,null,{"$f":"IF(D33=\"\",0,ROUND((($C33-15)-(IF(D33<=15,15,IF(D33>$C33,$C33,D33))-15))/($C33-15)*$B33,Round))","v":0}]
[null,3,45,null,{"$f":"IF(D34=\"\",0,IF(D34<=(C34-20),$B34,0))","v":0}]
[null,3,50,null,{"$f":"IF(D35=\"\",0,IF(D35<=(C35-20),$B35,0))","v":0}]
[null,3,55,null,0]
[null,1,60,null,0]
[null,"CBLA-50 RESULT",null,{"$f":"SUM(E30:E33,E34:E37)","v":0}]
[]
[null,"CBLA-25",null,"TTCFCW","Points"]
[null,3,50,null,{"$f":"IF(D41=\"\",0,IF(D41>=1.7,$B41,0))","v":0}]
[null,3,55,null,{"$f":"IF(D42=\"\",0,IF(D42>=1.7,$B42,0))","v":0}]
[null,1,60,null,0]
[null,1,65,null,0]
[null,1,70,null,0]
[null,1,75,null,0]
[null,1,80,null,0]
[null,"CBLA-25 RESULT",null,{"$f":"SUM(E41:E45,E46:E47)","v":0}]
[]
[null,"SUMMARY"]
[null,null,"CBNA-50",{"$f":"ROUND(D27/9,Round)","v":0}]
[null,null,"CBLA",{"$f":"ROUND((D38+D48)/27,Round)","v":0}]
[]
[null,"TOTAL AEB Cyclist",null,{"$f":"IF(D15=\"FAIL\",0,ROUND(AVERAGE(D51:E52)*6,Round))","v":0}]

{"sheet":"LSS","index":7,"n_rows":90,"n_cols":13,"rows_kept":90,"cut":false,"hidden":false,"merged":[[75,1,75,2],[75,3,75,8],[75,9,75,14],[76,1,76,14],[77,1,77,2],[77,3,77,14],[78,1,78,14],[72,9,72,11],[72,12,72,14],[73,3,73,5],[73,6,73,8],[73,9,73,11],[73,12,73,14],[74,3,74,5],[74,6,74,8],[74,9,74,11],[74,12,74,14],[87,3,87,14],[88,1,88,14],[89,1,89,2],[89,3,89,14],[83,1,83,14],[84,1,84,2],[84,3,84,14],[85,3,85,14],[86,3,86,14],[68,1,68,14],[79,3,79,14],[80,3,80,14],[81,3,81,14],[82,1,82,2],[82,3,82,14],[65,1,65,2],[65,3,65,8],[65,9,65,14],[66,1,66,14],[67,1,67,2],[67,3,67,14],[69,3,69,8],[69,9,69,14],[70,3,70,5],[70,6,70,8],[70,9,70,11],[70,12,70,14],[71,3,71,5],[71,6,71,8],[71,9,71,11],[71,12,71,14],[72,3,72,5],[72,6,72,8],[63,3,63,5],[63,6,63,8],[63,9,63,11],[63,12,63,14],[64,3,64,5],[64,6,64,8],[64,9,64,11],[64,12,64,14],[61,3,61,5],[61,6,61,8],[61,9,61,11],[61,12,61,14],[62,3,62,5],[62,6,62,8],[62,9,62,11],[62,12,62,14],[59,3,59,8],[59,9,59,14],[60,3,60,5],[60,6,60,8],[60,9,60,11],[60,12,60,14],[57,3,57,5],[57,6,57,8],[57,9,57,11],[57,12,57,14],[58,1,58,2],[58,3,58,8],[58,9,58,14],[55,3,55,5],[55,6,55,8],[55,9,55,11],[55,12,55,14],[56,3,56,5],[56,6,56,8],[56,9,56,11],[56,12,56,14],[53,3,53,5],[53,6,53,8],[53,9,53,11],[53,12,53,14],[54,3,54,5],[54,6,54,8],[54,9,54,11],[54,12,54,14],[51,1,51,2],[51,3,51,8],[51,9,51,14],[52,3,52,8],[52,9,52,14],[49,3,49,5],[49,6,49,8],[49,9,49,11],[49,12,49,14],[50,3,50,5],[50,6,50,8],[50,9,50,11],[50,12,50,14],[47,3,47,5],[47,6,47,8],[47,9,47,11],[47,12,47,14],[48,3,48,5],[48,6,48,8],[48,9,48,11],[48,12,48,14],[45,3,45,8],[45,9,45,14],[46,3,46,5],[46,6,46,8],[46,9,46,11],[46,12,46,14],[34,3,34,8],[34,9,34,14],[41,1,41,2],[42,1,42,14],[44,1,44,14],[35,3,35,8],[35,9,35,14],[36,3,36,8],[36,9,36,14],[37,3,37,8],[37,9,37,14],[38,3,38,8],[38,9,38,14],[39,3,39,8],[39,9,39,14],[40,3,40,8],[40,9,40,14],[31,3,31,8],[31,9,31,14],[32,3,32,8],[32,9,32,14],[33,3,33,8],[33,9,33,14],[23,3,23,14],[24,3,24,14],[25,3,25,14],[27,3,27,14],[18,3,18,6],[18,7,18,10],[18,11,18,14],[19,3,19,6],[43,1,43,2],[43,3,43,14],[29,3,29,8],[41,3,41,14],[29,9,29,14],[30,3,30,8],[30,9,30,14],[28,1,28,2],[28,3,28,14],[21,3,21,6],[21,7,21,10],[21,11,21,14],[22,1,22,2],[22,3,22,14],[19,7,19,10],[19,11,19,14],[20,3,20,6],[20,7,20,10],[20,11,20,14],[26,3,26,14],[6,3,6,14],[4,3,4,14],[5,3,5,14],[1,3,3,14],[17,3,17,6],[17,7,17,10],[17,11,17,14],[13,1,13,2],[13,3,13,14],[14,1,14,14],[15,3,15,14],[16,3,16,6],[16,7,16,10],[16,11,16,14],[7,3,7,14],[8,3,8,14],[9,1,9,14],[11,3,11,14],[10,3,10,14],[12,3,12,14],[1,1,3,2]]}
[3]
[null,"Lane Support Systems"]
[]
[]
[null,"SYSTEM DETAILS"]
[null,null,"System Name"]
[null,null,"Default ON (partly)"]
[null,null,"Speed range (km/h) - Minimum"]
[null,null,"Maximum"]
[]
[null,"PREREQUISITES"]
[]
[null,null,"ESC meeting R13H"]
[null,"PREREQUISITES",null,{"$f":"IF(AND(D13=\"YES\"),\"PASS\",\"FAIL\")","v":"FAIL"}]
[]
[null,"Emergency Lane Keeping"]
[null,null,"Road Edge","No line",null,null,null,"Dashed line",null,null,null,"Solid line"]
[null,null,0.2]
[null,null,0.3]
[null,null,0.4]
[null,null,0.5]
[null,null,null,{"$f":"IF(OR(COUNTIF(D18:G21,\">-0.1\")=4,COUNTIF(D18:G21,\">-0,1\")=4),0.25,0)","v":0},null,null,null,{"$f":"IF(OR(COUNTIF(H18:K21,\">-0.1\")=4,COUNTIF(H18:K21,\">-0,1\")=4),0.25,0)","v":0},null,null,null,{"$f":"IF(OR(COUNTIF(L18:O21,\">-0.1\")=4,COUNTIF(L18:O21,\">-0,1\")=4),0.25,0)","v":0}]
[null,"ELK Road Edge assessment",null,{"$f":"SUM(D22:L22)","v":0}]
[null,null,"Oncoming vehicle"]
[null,null,0.3]
[null,null,0.4]
[null,null,0.5]
[null,null,0.6]
[null,"ELK Oncoming vehicle assessment",null,{"$f":"IF(COUNTIF(D25:O28,\"PASS\")=4,0.5,0)","v":0}]
[null,null,"Overtaking vehicle (GVT @ 72km/h)","Unintentional",null,null,null,null,null,"Intentional"]
[null,null,0.3]
[null,null,0.4]
[null,null,0.5]
[null,null,0.6]
[null,null,0.7]
[null,null,"Overtaking vehicle (GVT @ 80km/h)"]
[null,null,0.3]
[null,null,0.4]
[null,null,0.5]
[null,null,0.6]
[null,null,0.7]
[null,"ELK Overtaking vehicle assessment",null,{"$f":"IF(COUNTIF(D31:O41,\"PASS\")=14,0.25,0)","v":0}]
[]
[null,"ELK RESULT",null,{"$f":"SUM(D23,D29,D42)","v":0}]
[]
[null,"Lane Keep Assist",null,"Single lane marking",null,null,null,null,null,"Fully marked lane"]
[null,null,"Road Edge",null,null,null,"Passenger side",null,null,null,null,null,"Passenger side"]
[null,null,0.2]
[null,null,0.3]
[null,null,0.4]
[null,null,0.5]
[null,"LKA Road Edge assessment",null,{"$f":"IF(OR(COUNTIF(D48:I51,\">-0.1\")=4,COUNTIF(D48:I51,\">-0,1\")=4),0.25,0)","v":0},null,null,null,null,null,{"$f":"IF(OR(COUNTIF(J48:O51,\">-0.1\")=4,COUNTIF(J48:O51,\">-0,1\")=4),0.25,0)","v":0}]
[null,null,null,"Single lane marking",null,null,null,null,null,"Fully marked lane"]
[null,null,"Dashed Line","Driver side",null,null,"Passenger side",null,null,"Driver side",null,null,"Passenger side"]
[null,null,0.2]
[null,null,0.3]
[null,null,0.4]
[null,null,0.5]
[null,"LKA Dashed Line assessment",null,{"$f":"IF(OR(COUNTIF(D55:I58,\">-0.3\")=8,COUNTIF(D55:I58,\">-0,3\")=8),0.25,0)","v":0},null,null,null,null,null,{"$f":"IF(OR(COUNTIF(J55:O58,\">-0.3\")=8,COUNTIF(J55:O58,\">-0,3\")=8),0.5,0)","v":0}]
[null,null,null,"Single lane marking",null,null,null,null,null,"Fully marked lane"]
[null,null,"Solid Line","Driver side",null,null,"Passenger side",null,null,"Driver side",null,null,"Passenger side"]
[null,null,0.2]
[null,null,0.3]
[null,null,0.4]
[null,null,0.5]
[null,"LKA Solid Line assessment",null,{"$f":"IF(OR(COUNTIF(D62:I65,\">-0.3\")=8,COUNTIF(D62:I65,\">-0,3\")=8),0.25,0)","v":0},null,null,null,null,null,{"$f":"IF(OR(COUNTIF(J62:O65,\">-0.3\")=8,COUNTIF(J62:O65,\">-0,3\")=8),0.5,0)","v":0}]
[]
[null,"LKA RESULT",null,{"$f":"SUM(D52,J52,D59,J59,D66,J66)","v":0}]
[]
[null,"Lane Departure Warning",null,"Solid Line",null,null,null,null,null,"Dashed Line"]
[null,null,"Single lane marking","Driver side",null,null,"Passenger side",null,null,"Driver side",null,null,"Passenger side"]
[null,null,0.2]
[null,null,0.3]
[null,null,0.4]
[null,null,0.5]
[null,"LDW Solid Line assessment",null,{"$f":"IF(OR(COUNTIF(D72:I75,\">-0.2\")=8,COUNTIF(D72:I75,\">-0,2\")=8),\"PASS\",\"FAIL\")","v":"FAIL"},null,null,null,null,null,{"$f":"IF(OR(COUNTIF(J72:O75,\">-0.2\")=8,COUNTIF(J72:O75,\">-0,2\")=8),\"PASS\",\"FAIL\")","v":"FAIL"}]
[]
[null,"LDW RESULT",null,{"$f":"IF(AND(D76=\"PASS\",J76=\"PASS\"),\"PASS\",\"FAIL\")","v":"FAIL"}]
[]
[null,"HMI"]
[null,1,"Lane Departure Warning",{"$f":"D78","v":"FAIL"}]
[null,2,"Blind Spot Monitoring"]
[null,"HMI RESULT",null,{"$f":"IF(D81=\"PASS\",0.25,0)+IF(D82=\"PASS\",0.25,0)","v":0}]
[]
[null,"SUMMARY"]
[null,null,"ELK",{"$f":"D44","v":0}]
[null,null,"LKA",{"$f":"D68","v":0}]
[null,null,"HMI",{"$f":"D83","v":0}]
[]
[null,"TOTAL Lane Support Systems",null,{"$f":"IF(D14=\"FAIL\",0,ROUND(SUM(D86:O88),Round))","v":0}]

{"sheet":"SAS","index":8,"n_rows":48,"n_cols":5,"rows_kept":48,"cut":false,"hidden":false,"merged":[[29,3,29,4],[30,3,30,4],[45,3,45,4],[32,3,32,4],[31,3,31,4],[47,1,47,2],[47,3,47,4],[41,1,41,2],[41,3,41,4],[44,3,44,4],[43,1,43,2],[43,3,43,4],[8,3,8,4],[27,1,27,2],[27,3,27,4],[6,3,6,4],[1,3,2,4],[4,3,4,4],[5,3,5,4],[9,3,9,4],[11,3,11,4],[1,1,3,2]]}
[]
[null,"Speed Assistance System"]
[]
[null,null,null,"Value","Score"]
[null,"SYSTEM DETAILS"]
[null,null,"System name"]
[null,null,"Functionality"]
[]
[null,"SPEED LIMIT INFORMATION FUNCTION"]
[null,null,"Type of system"]
[null,null,"General requirements",null,{"$f":"IF(D11=\"Pass\",0.5,0)","v":0}]
[null,null,"Advanced Functions"]
[null,null,"Weather - Rain / Wetness",null,{"$f":"IF(D13=\"Pass\",0.05,0)","v":0}]
[null,null,"Weather - Snow / Icy",null,{"$f":"IF(D14=\"Pass\",0.05,0)","v":0}]
[null,null,"Time",null,{"$f":"IF(D15=\"Pass\",0.075,0)","v":0}]
[null,null,"Distance For / In",null,{"$f":"IF(D16=\"Pass\",0.025,0)","v":0}]
[null,null,"Arrows",null,{"$f":"IF(D17=\"Pass\",0.025,0)","v":0}]
[null,null,"Vehicle Categories",null,{"$f":"IF(D18=\"Pass\",0.025,0)","v":0}]
[null,null,"Implicit Speed Limits - Highway / Motorway",null,{"$f":"IF(D19=\"Pass\",0.05,0)","v":0}]
[null,null,"Implicit Speed Limits - City Entry / Exit",null,{"$f":"IF(D20=\"Pass\",0.075,0)","v":0}]
[null,null,"Implicit Speed Limits - Residential Zones",null,{"$f":"IF(D21=\"Pass\",0.05,0)","v":0}]
[null,null,"Dynamic Speed Limits",null,{"$f":"IF(D22=\"Pass\",0.075,0)","v":0}]
[null,null,"System Accuracy",null,{"$f":"IF(SUM(E13:E22)>0.3,0.25,0)","v":0}]
[null,null,"Warning Function",null,{"$f":"IF(AND(E25=\"Pass\",E26=\"Pass\",E27=\"Pass\"),0.25,0)","v":0}]
[null,null,"Position of warning",null,{"$f":"IF(D25=\"\",\"\",IF(D25<>\"Other\",\"Pass\",\"Fail\"))","v":""}]
[null,null,"Type of warning",null,{"$f":"IF(D26=\"\",\"\",IF(D26<>\"Other\",\"Pass\",\"Fail\"))","v":""}]
[null,null,"Total duration ",null,{"$f":"IF(D27=\"\",\"\",IF(AND(D27<>\"\",D27>=10),\"Pass\",\"Fail\"))","v":""}]
[null,"SPEED LIMIT INFORMATION FUNCTION RESULT",null,{"$f":"SUM(E11:E24)","v":0}]
[]
[null,"SPEED CONTROL FUNCTION"]
[null,null,"Setting Vadj"]
[]
[null,null,"50 km/h test"]
[null,null,"Vstab",null,{"$f":"IF(AND(D34<>\"\",D34>=45),\"Pass\",\"Fail\")","v":"Fail"}]
[null,null,"difference between Vstab and Vadj",{"$f":"IF(D34=\"\",\"\",50-D34)","v":""}]
[null,null,"80 km/h test"]
[null,null,"Vstab",null,{"$f":"IF(AND(D37<>\"\",D37>=75),\"Pass\",\"Fail\")","v":"Fail"}]
[null,null,"difference between Vstab and Vadj",{"$f":"IF(D37=\"\",\"\",80-D37)","v":""}]
[null,null,"120 km/h test"]
[null,null,"Vstab",null,{"$f":"IF(AND(D40<>\"\",D40>=115),\"Pass\",\"Fail\")","v":"Fail"}]
[null,null,"difference between Vstab and Vadj",{"$f":"IF(D40=\"\",\"\",120-D40)","v":""}]
[null,"SPEED CONTROL FUNCTION RESULT",null,{"$f":"IF(AND(D35<=5,D38<=5,D41<=5),IF(D31=\"System advised\",1.5,IF(D31=\"Manually set\",IF(D28>0,0.75,1.25),0)),0)","v":0}]
[]
[null,"SUMMARY"]
[null,null,"Speed Limit Information Function",{"$f":"D28","v":0}]
[null,null,"Speed Control Function",{"$f":"D42","v":0}]
[]
[null,"TOTAL SAS",null,{"$f":"ROUND(SUM(D45:E46),Round)","v":0}]

{"sheet":"OSM","index":9,"n_rows":21,"n_cols":6,"rows_kept":21,"cut":false,"hidden":false,"merged":[[6,3,6,4],[5,5,5,6],[5,3,5,4],[1,3,2,4],[4,3,4,4],[1,5,2,6],[4,5,4,6],[17,3,17,6],[19,1,19,2],[19,3,19,6],[16,3,16,6],[7,3,7,4],[7,5,7,6],[1,1,3,2],[13,1,13,2],[13,3,13,6],[15,1,15,2],[15,3,15,6],[10,3,10,4],[10,5,10,6],[11,3,11,4],[11,5,12,6],[12,3,12,4],[8,1,8,2],[3,5,3,6],[8,3,8,4],[8,5,8,6],[3,3,3,4],[6,5,6,6]]}
[]
[null,"Occupant Status Monitoring",null,"Driver",null,"Front Passenger"]
[]
[null,null,null,"Score",null,"Score"]
[null,"SEAT BELT REMINDER"]
[null,null,"Occupant detection"]
[null,null,"Visual warning"]
[null,null,"Audible warning"]
[null,"Seat Belt Reminder assessment",null,{"$f":"IF(COUNTIF(D6:E8,\"Pass\")=2,1,0)","v":0},null,{"$f":"IF(COUNTIF(F6:G8,\"Pass\")=3,1,0)","v":0}]
[]
[null,"DRIVER MONITORING"]
[null,null,"Default ON",null,null,{"$f":"IF(AND(D12=\"PASS\",D13=\"PASS\"),1,0)","v":0}]
[null,null,"Attention Assist fitment"]
[null,"Driver Monitoring assessment",null,{"$f":"F12","v":0}]
[]
[null,"SUMMARY"]
[null,null,"Seat Belt Reminder assessment",{"$f":"SUM(D9:G9)","v":0}]
[null,null,"Driver Monitoring assessment",{"$f":"D14","v":0}]
[]
[null,"TOTAL OCCUPANT STATUS MONITORING",null,{"$f":"D17+D18","v":0}]
[null,null,null,{"$f":"IF(AND(D9=2,#REF!>0),\"All seats\",IF(D9=2,\"Front seats\",\"Not available\"))","v":{"$error":"#REF!"}}]

{"sheet":"Summary","index":10,"n_rows":381,"n_cols":24,"rows_kept":381,"cut":false,"hidden":true,"merged":[[54,12,54,13],[54,15,54,16],[54,19,54,20],[54,22,54,23],[40,19,40,20],[40,22,40,23],[53,12,53,13],[53,15,53,16],[53,19,53,20],[53,22,53,23],[39,22,39,23],[37,12,37,13],[37,15,37,16],[38,12,38,13],[38,15,38,16],[39,19,39,20]]}
["Make",{"$f":"'General Overview'!C3","v":0},"text"]
["Model",{"$f":"'General Overview'!C4","v":0},"text"]
["Full Tested Vehicle",{"$f":"'General Overview'!C5","v":0},"text"]
["Rating/grading",{"$f":"'OVERALL RATING'!F2","v":"NOT RECOMMENDED"},"platinum - gold - silver - bronze - not recommended"]
["Safety Assist Performance score",{"$f":"'OVERALL RATING'!F14","v":0},"%"]
["Specification"]
["Body type",{"$f":"'General Overview'!C6","v":0},"Monocoque"]
["Category",{"$f":"'General Overview'!C7","v":0},"text","N1 - N2"]
["Kerb weight",{"$f":"'General Overview'!C9","v":0},"number"]
["Maximum Payload",{"$f":"'General Overview'!C11","v":0},"number"]
["Test weight",{"$f":"'General Overview'!C12","v":0},"number"]
["Applies to",{"$f":"'General Overview'!C17","v":0},"x generation"]
["Safety equipment"]
["SBR - Driver",{"$f":"'N1 Fitment'!V34","v":"N/A"},"standard/optional/not available"]
["SBR - Passenger",{"$f":"'N1 Fitment'!X34","v":"N/A"},"standard/optional/not available"]
["AEB Car-to-Car",{"$f":"'N1 Fitment'!N34","v":"N/A"},"standard/optional/not available"]
["AEB Pedestrian",{"$f":"'N1 Fitment'!O34","v":"N/A"},"standard/optional/not available"]
["AEB Cyclist",{"$f":"'N1 Fitment'!P34","v":"N/A"},"standard/optional/not available"]
["Attention Assist",{"$f":"'N1 Fitment'!T34","v":"N/A"},"standard/optional/not available"]
["LSS",{"$f":"FITMENT!G25","v":"N/A"},"standard/optional/not available"]
["SAS",{"$f":"FITMENT!G36","v":"N/A"},"standard/optional/not available"]
["Verdict",{"$f":"'OVERALL RATING'!B18","v":0},"text"]
["Comment",{"$f":"'OVERALL RATING'!B19","v":0},"text"]
["Safety Assist Performance Details"]
["AEB Car-to-Car - score",{"$f":"IF(B16=\"n/a\",\"N/A$\",'OVERALL RATING'!G6)","v":"N/A$"},"number - 1 decimal"]
["AEB Car-to-Car - colour",{"$f":"IF(B16=\"N/A\",\"Grey\",IF(B25/30>=0.75,\"Green\",IF(B25/30>=0.5,\"Yellow\",IF(B25/30>=0.25,\"Orange\",IF(B25/30>0,\"Brown\",\"Red\")))))","v":"Grey"},"Green - Yellow - Orange - Brown - Red"]
["AEB_Type",{"$f":"IF(B25=\"N/A$\",\"\",CONCATENATE(IF('AEB Car-to-Car'!D7=\"YES\",\"AEB\",\"\"),IF(AND('AEB Car-to-Car'!D7=\"YES\",'AEB Car-to-Car'!I7=\"YES\"),\" & \",\"\"),IF('AEB Car-to-Car'!I7=\"YES\",\"FCW\",\"\")))","v":""},"text",null,null,null,null,null,null,null,null,"CCRs"]
["AEB_Operational from",{"$f":"IF(B25=\"N/A$\",\"\",MIN('AEB Car-to-Car'!D8,'AEB Car-to-Car'!I8))","v":""},"text",null,null,null,null,null,"Green",1,null,"AEB",null,null,null,null,null,null,"FCW"]
["Autobrake function only",null,null,null,null,null,null,null,"Yellow",0.75,null,1,{"$f":"VLOOKUP('AEB Car-to-Car'!D18,Summary!$I$28:$J$32,2,0)*$L29","v":{"$error":"#N/A"}},{"$f":"VLOOKUP('AEB Car-to-Car'!E18,Summary!$I$28:$J$32,2,0)*$L29","v":{"$error":"#N/A"}},{"$f":"VLOOKUP('AEB Car-to-Car'!F18,Summary!$I$28:$J$32,2,0)*$L29","v":{"$error":"#N/A"}},{"$f":"VLOOKUP('AEB Car-to-Car'!G18,Summary!$I$28:$J$32,2,0)*$L29","v":{"$error":"#N/A"}},{"$f":"VLOOKUP('AEB Car-to-Car'!H18,Summary!$I$28:$J$32,2,0)*$L29","v":{"$error":"#N/A"}},null,2,{"$f":"VLOOKUP('AEB Car-to-Car'!I22,Summary!$I$28:$J$32,2,0)*$S29","v":{"$error":"#N/A"}},{"$f":"VLOOKUP('AEB Car-to-Car'!J22,Summary!$I$28:$J$32,2,0)*$S29","v":{"$error":"#N/A"}},{"$f":"VLOOKUP('AEB Car-to-Car'!K22,Summary!$I$28:$J$32,2,0)*$S29","v":{"$error":"#N/A"}},{"$f":"VLOOKUP('AEB Car-to-Car'!L22,Summary!$I$28:$J$32,2,0)*$S29","v":{"$error":"#N/A"}},{"$f":"VLOOKUP('AEB Car-to-Car'!M22,Summary!$I$28:$J$32,2,0)*$S29","v":{"$error":"#N/A"}}]
["AFO_Approaching a stationary car - right overlap",{"$f":"IF(B$25=\"N/A$\",\"Grey\",P39)","v":"Grey"},"Green - Yellow - Orange - Brown - Red",null,null,null,null,null,"Orange",0.5,null,2,{"$f":"VLOOKUP('AEB Car-to-Car'!D19,Summary!$I$28:$J$32,2,0)*$L30","v":{"$error":"#N/A"}},{"$f":"VLOOKUP('AEB Car-to-Car'!E19,Summary!$I$28:$J$32,2,0)*$L30","v":{"$error":"#N/A"}},{"$f":"VLOOKUP('AEB Car-to-Car'!F19,Summary!$I$28:$J$32,2,0)*$L30","v":{"$error":"#N/A"}},{"$f":"VLOOKUP('AEB Car-to-Car'!G19,Summary!$I$28:$J$32,2,0)*$L30","v":{"$error":"#N/A"}},{"$f":"VLOOKUP('AEB Car-to-Car'!H19,Summary!$I$28:$J$32,2,0)*$L30","v":{"$error":"#N/A"}},null,2,{"$f":"VLOOKUP('AEB Car-to-Car'!I23,Summary!$I$28:$J$32,2,0)*$S30","v":{"$error":"#N/A"}},{"$f":"VLOOKUP('AEB Car-to-Car'!J23,Summary!$I$28:$J$32,2,0)*$S30","v":{"$error":"#N/A"}},{"$f":"VLOOKUP('AEB Car-to-Car'!K23,Summary!$I$28:$J$32,2,0)*$S30","v":{"$error":"#N/A"}},{"$f":"VLOOKUP('AEB Car-to-Car'!L23,Summary!$I$28:$J$32,2,0)*$S30","v":{"$error":"#N/A"}},{"$f":"VLOOKUP('AEB Car-to-Car'!M23,Summary!$I$28:$J$32,2,0)*$S30","v":{"$error":"#N/A"}}]
["AFO_Approaching a stationary car - no overlap",{"$f":"IF(B$25=\"N/A$\",\"Grey\",O39)","v":"Grey"},"Green - Yellow - Orange - Brown - Red",null,null,null,null,null,"Brown",0.25,null,2,{"$f":"VLOOKUP('AEB Car-to-Car'!D20,Summary!$I$28:$J$32,2,0)*$L31","v":{"$error":"#N/A"}},{"$f":"VLOOKUP('AEB Car-to-Car'!E20,Summary!$I$28:$J$32,2,0)*$L31","v":{"$error":"#N/A"}},{"$f":"VLOOKUP('AEB Car-to-Car'!F20,Summary!$I$28:$J$32,2,0)*$L31","v":{"$error":"#N/A"}},{"$f":"VLOOKUP('AEB Car-to-Car'!G20,Summary!$I$28:$J$32,2,0)*$L31","v":{"$error":"#N/A"}},{"$f":"VLOOKUP('AEB Car-to-Car'!H20,Summary!$I$28:$J$32,2,0)*$L31","v":{"$error":"#N/A"}},null,2,{"$f":"VLOOKUP('AEB Car-to-Car'!I24,Summary!$I$28:$J$32,2,0)*$S31","v":{"$error":"#N/A"}},{"$f":"VLOOKUP('AEB Car-to-Car'!J24,Summary!$I$28:$J$32,2,0)*$S31","v":{"$error":"#N/A"}},{"$f":"VLOOKUP('AEB Car-to-Car'!K24,Summary!$I$28:$J$32,2,0)*$S31","v":{"$error":"#N/A"}},{"$f":"VLOOKUP('AEB Car-to-Car'!L24,Summary!$I$28:$J$32,2,0)*$S31","v":{"$error":"#N/A"}},{"$f":"VLOOKUP('AEB Car-to-Car'!M24,Summary!$I$28:$J$32,2,0)*$S31","v":{"$error":"#N/A"}}]
["AFO_Approaching a stationary car - left overlap",{"$f":"IF(B$25=\"N/A$\",\"Grey\",M39)","v":"Grey"},"Green - Yellow - Orange - Brown - Red",null,null,null,null,null,"Red",0,null,2,{"$f":"VLOOKUP('AEB Car-to-Car'!D21,Summary!$I$28:$J$32,2,0)*$L32","v":{"$error":"#N/A"}},{"$f":"VLOOKUP('AEB Car-to-Car'!E21,Summary!$I$28:$J$32,2,0)*$L32","v":{"$error":"#N/A"}},{"$f":"VLOOKUP('AEB Car-to-Car'!F21,Summary!$I$28:$J$32,2,0)*$L32","v":{"$error":"#N/A"}},{"$f":"VLOOKUP('AEB Car-to-Car'!G21,Summary!$I$28:$J$32,2,0)*$L32","v":{"$error":"#N/A"}},{"$f":"VLOOKUP('AEB Car-to-Car'!H21,Summary!$I$28:$J$32,2,0)*$L32","v":{"$error":"#N/A"}},null,2,{"$f":"VLOOKUP('AEB Car-to-Car'!I25,Summary!$I$28:$J$32,2,0)*$S32","v":{"$error":"#N/A"}},{"$f":"VLOOKUP('AEB Car-to-Car'!J25,Summary!$I$28:$J$32,2,0)*$S32","v":{"$error":"#N/A"}},{"$f":"VLOOKUP('AEB Car-to-Car'!K25,Summary!$I$28:$J$32,2,0)*$S32","v":{"$error":"#N/A"}},{"$f":"VLOOKUP('AEB Car-to-Car'!L25,Summary!$I$28:$J$32,2,0)*$S32","v":{"$error":"#N/A"}},{"$f":"VLOOKUP('AEB Car-to-Car'!M25,Summary!$I$28:$J$32,2,0)*$S32","v":{"$error":"#N/A"}}]
["AFO_Approaching a slower moving car - right overlap",{"$f":"IF(B$25=\"N/A$\",\"Grey\",P55)","v":"Grey"},"Green - Yellow - Orange - Brown - Red",null,null,null,null,null,null,null,null,2,{"$f":"VLOOKUP('AEB Car-to-Car'!D22,Summary!$I$28:$J$32,2,0)*$L33","v":{"$error":"#N/A"}},{"$f":"VLOOKUP('AEB Car-to-Car'!E22,Summary!$I$28:$J$32,2,0)*$L33","v":{"$error":"#N/A"}},{"$f":"VLOOKUP('AEB Car-to-Car'!F22,Summary!$I$28:$J$32,2,0)*$L33","v":{"$error":"#N/A"}},{"$f":"VLOOKUP('AEB Car-to-Car'!G22,Summary!$I$28:$J$32,2,0)*$L33","v":{"$error":"#N/A"}},{"$f":"VLOOKUP('AEB Car-to-Car'!H22,Summary!$I$28:$J$32,2,0)*$L33","v":{"$error":"#N/A"}},null,3,{"$f":"VLOOKUP('AEB Car-to-Car'!I26,Summary!$I$28:$J$32,2,0)*$S33","v":{"$error":"#N/A"}},{"$f":"VLOOKUP('AEB Car-to-Car'!J26,Summary!$I$28:$J$32,2,0)*$S33","v":{"$error":"#N/A"}},{"$f":"VLOOKUP('AEB Car-to-Car'!K26,Summary!$I$28:$J$32,2,0)*$S33","v":{"$error":"#N/A"}},{"$f":"VLOOKUP('AEB Car-to-Car'!L26,Summary!$I$28:$J$32,2,0)*$S33","v":{"$error":"#N/A"}},{"$f":"VLOOKUP('AEB Car-to-Car'!M26,Summary!$I$28:$J$32,2,0)*$S33","v":{"$error":"#N/A"}}]
["AFO_Approaching a slower moving car - no overlap",{"$f":"IF(B$25=\"N/A$\",\"Grey\",O55)","v":"Grey"},"Green - Yellow - Orange - Brown - Red",null,null,null,null,null,null,null,null,2,{"$f":"VLOOKUP('AEB Car-to-Car'!D23,Summary!$I$28:$J$32,2,0)*$L34","v":{"$error":"#N/A"}},{"$f":"VLOOKUP('AEB Car-to-Car'!E23,Summary!$I$28:$J$32,2,0)*$L34","v":{"$error":"#N/A"}},{"$f":"VLOOKUP('AEB Car-to-Car'!F23,Summary!$I$28:$J$32,2,0)*$L34","v":{"$error":"#N/A"}},{"$f":"VLOOKUP('AEB Car-to-Car'!G23,Summary!$I$28:$J$32,2,0)*$L34","v":{"$error":"#N/A"}},{"$f":"VLOOKUP('AEB Car-to-Car'!H23,Summary!$I$28:$J$32,2,0)*$L34","v":{"$error":"#N/A"}},null,2,{"$f":"VLOOKUP('AEB Car-to-Car'!I27,Summary!$I$28:$J$32,2,0)*$S34","v":{"$error":"#N/A"}},{"$f":"VLOOKUP('AEB Car-to-Car'!J27,Summary!$I$28:$J$32,2,0)*$S34","v":{"$error":"#N/A"}},{"$f":"VLOOKUP('AEB Car-to-Car'!K27,Summary!$I$28:$J$32,2,0)*$S34","v":{"$error":"#N/A"}},{"$f":"VLOOKUP('AEB Car-to-Car'!L27,Summary!$I$28:$J$32,2,0)*$S34","v":{"$error":"#N/A"}},{"$f":"VLOOKUP('AEB Car-to-Car'!M27,Summary!$I$28:$J$32,2,0)*$S34","v":{"$error":"#N/A"}}]
["AFO_Approaching a slower moving car - left overlap",{"$f":"IF(B$25=\"N/A$\",\"Grey\",M55)","v":"Grey"},"Green - Yellow - Orange - Brown - Red",null,null,null,null,null,null,null,null,1,{"$f":"VLOOKUP('AEB Car-to-Car'!D24,Summary!$I$28:$J$32,2,0)*$L35","v":{"$error":"#N/A"}},{"$f":"VLOOKUP('AEB Car-to-Car'!E24,Summary!$I$28:$J$32,2,0)*$L35","v":{"$error":"#N/A"}},{"$f":"VLOOKUP('AEB Car-to-Car'!F24,Summary!$I$28:$J$32,2,0)*$L35","v":{"$error":"#N/A"}},{"$f":"VLOOKUP('AEB Car-to-Car'!G24,Summary!$I$28:$J$32,2,0)*$L35","v":{"$error":"#N/A"}},{"$f":"VLOOKUP('AEB Car-to-Car'!H24,Summary!$I$28:$J$32,2,0)*$L35","v":{"$error":"#N/A"}},null,1,{"$f":"VLOOKUP('AEB Car-to-Car'!I28,Summary!$I$28:$J$32,2,0)*$S35","v":{"$error":"#N/A"}},{"$f":"VLOOKUP('AEB Car-to-Car'!J28,Summary!$I$28:$J$32,2,0)*$S35","v":{"$error":"#N/A"}},{"$f":"VLOOKUP('AEB Car-to-Car'!K28,Summary!$I$28:$J$32,2,0)*$S35","v":{"$error":"#N/A"}},{"$f":"VLOOKUP('AEB Car-to-Car'!L28,Summary!$I$28:$J$32,2,0)*$S35","v":{"$error":"#N/A"}},{"$f":"VLOOKUP('AEB Car-to-Car'!M28,Summary!$I$28:$J$32,2,0)*$S35","v":{"$error":"#N/A"}}]
["AFO_Approaching a braking car",{"$f":"IF(B$25=\"N/A$\",\"Grey\",IF('AEB Car-to-Car'!D57>=0.75,\"Green\",IF('AEB Car-to-Car'!D57>=0.5,\"Yellow\",IF('AEB Car-to-Car'!D57>=0.25,\"Orange\",IF('AEB Car-to-Car'!D57>0,\"Brown\",\"Red\")))))","v":"Grey"},"Green - Yellow - Orange - Brown - Red",null,null,null,null,null,null,null,null,1,{"$f":"VLOOKUP('AEB Car-to-Car'!D25,Summary!$I$28:$J$32,2,0)*$L36","v":{"$error":"#N/A"}},{"$f":"VLOOKUP('AEB Car-to-Car'!E25,Summary!$I$28:$J$32,2,0)*$L36","v":{"$error":"#N/A"}},{"$f":"VLOOKUP('AEB Car-to-Car'!F25,Summary!$I$28:$J$32,2,0)*$L36","v":{"$error":"#N/A"}},{"$f":"VLOOKUP('AEB Car-to-Car'!G25,Summary!$I$28:$J$32,2,0)*$L36","v":{"$error":"#N/A"}},{"$f":"VLOOKUP('AEB Car-to-Car'!H25,Summary!$I$28:$J$32,2,0)*$L36","v":{"$error":"#N/A"}},null,1,{"$f":"VLOOKUP('AEB Car-to-Car'!I29,Summary!$I$28:$J$32,2,0)*$S36","v":{"$error":"#N/A"}},{"$f":"VLOOKUP('AEB Car-to-Car'!J29,Summary!$I$28:$J$32,2,0)*$S36","v":{"$error":"#N/A"}},{"$f":"VLOOKUP('AEB Car-to-Car'!K29,Summary!$I$28:$J$32,2,0)*$S36","v":{"$error":"#N/A"}},{"$f":"VLOOKUP('AEB Car-to-Car'!L29,Summary!$I$28:$J$32,2,0)*$S36","v":{"$error":"#N/A"}},{"$f":"VLOOKUP('AEB Car-to-Car'!M29,Summary!$I$28:$J$32,2,0)*$S36","v":{"$error":"#N/A"}}]
["Driver Reacts to Warning",null,null,null,null,null,null,null,null,null,null,1,{"$f":"VLOOKUP('AEB Car-to-Car'!D26,Summary!$I$28:$J$32,2,0)*$L37","v":{"$error":"#N/A"}},{"$f":"VLOOKUP('AEB Car-to-Car'!E26,Summary!$I$28:$J$32,2,0)*$L37","v":{"$error":"#N/A"}},{"$f":"VLOOKUP('AEB Car-to-Car'!F26,Summary!$I$28:$J$32,2,0)*$L37","v":{"$error":"#N/A"}},{"$f":"VLOOKUP('AEB Car-to-Car'!G26,Summary!$I$28:$J$32,2,0)*$L37","v":{"$error":"#N/A"}},{"$f":"VLOOKUP('AEB Car-to-Car'!H26,Summary!$I$28:$J$32,2,0)*$L37","v":{"$error":"#N/A"}},null,1,{"$f":"VLOOKUP('AEB Car-to-Car'!I30,Summary!$I$28:$J$32,2,0)*$S37","v":{"$error":"#N/A"}},{"$f":"VLOOKUP('AEB Car-to-Car'!J30,Summary!$I$28:$J$32,2,0)*$S37","v":{"$error":"#N/A"}},{"$f":"VLOOKUP('AEB Car-to-Car'!K30,Summary!$I$28:$J$32,2,0)*$S37","v":{"$error":"#N/A"}},{"$f":"VLOOKUP('AEB Car-to-Car'!L30,Summary!$I$28:$J$32,2,0)*$S37","v":{"$error":"#N/A"}},{"$f":"VLOOKUP('AEB Car-to-Car'!M30,Summary!$I$28:$J$32,2,0)*$S37","v":{"$error":"#N/A"}}]
["DRW_Approaching a stationary car - right overlap",{"$f":"IF(B$25=\"N/A$\",\"Grey\",W41)","v":"Grey"},"Green - Yellow - Orange - Brown - Red",null,null,null,null,null,null,null,null,null,{"$f":"SUM(M29:N37)/(2*SUM($L$29:$L$37))","v":{"$error":"#N/A"}},null,{"$f":"SUM(O29:O37)/(SUM($L$29:$L$37))","v":{"$error":"#N/A"}},{"$f":"SUM(P29:Q37)/(2*SUM($L$29:$L$37))","v":{"$error":"#N/A"}},null,null,1,{"$f":"VLOOKUP('AEB Car-to-Car'!I31,Summary!$I$28:$J$32,2,0)*$S38","v":{"$error":"#N/A"}},{"$f":"VLOOKUP('AEB Car-to-Car'!J31,Summary!$I$28:$J$32,2,0)*$S38","v":{"$error":"#N/A"}},{"$f":"VLOOKUP('AEB Car-to-Car'!K31,Summary!$I$28:$J$32,2,0)*$S38","v":{"$error":"#N/A"}},{"$f":"VLOOKUP('AEB Car-to-Car'!L31,Summary!$I$28:$J$32,2,0)*$S38","v":{"$error":"#N/A"}},{"$f":"VLOOKUP('AEB Car-to-Car'!M31,Summary!$I$28:$J$32,2,0)*$S38","v":{"$error":"#N/A"}}]
["DRW_Approaching a stationary car - no overlap",{"$f":"IF(B$25=\"N/A$\",\"Grey\",V41)","v":"Grey"},"Green - Yellow - Orange - Brown - Red",null,null,null,null,null,null,null,null,null,{"$f":"IF(M38>=0.75,\"Green\",IF(M38>=0.5,\"Yellow\",IF(M38>=0.25,\"Orange\",IF(M38>0,\"Brown\",\"Red\"))))","v":{"$error":"#N/A"}},null,{"$f":"IF(O38>=0.75,\"Green\",IF(O38>=0.5,\"Yellow\",IF(O38>=0.25,\"Orange\",IF(O38>0,\"Brown\",\"Red\"))))","v":{"$error":"#N/A"}},{"$f":"IF(P38>=0.75,\"Green\",IF(P38>=0.5,\"Yellow\",IF(P38>=0.25,\"Orange\",IF(P38>0,\"Brown\",\"Red\"))))","v":{"$error":"#N/A"}},null,null,1,{"$f":"VLOOKUP('AEB Car-to-Car'!I32,Summary!$I$28:$J$32,2,0)*$S39","v":{"$error":"#N/A"}},{"$f":"VLOOKUP('AEB Car-to-Car'!J32,Summary!$I$28:$J$32,2,0)*$S39","v":{"$error":"#N/A"}},{"$f":"VLOOKUP('AEB Car-to-Car'!K32,Summary!$I$28:$J$32,2,0)*$S39","v":{"$error":"#N/A"}},{"$f":"VLOOKUP('AEB Car-to-Car'!L32,Summary!$I$28:$J$32,2,0)*$S39","v":{"$error":"#N/A"}},{"$f":"VLOOKUP('AEB Car-to-Car'!M32,Summary!$I$28:$J$32,2,0)*$S39","v":{"$error":"#N/A"}}]
["DRW_Approaching a stationary car - left overlap",{"$f":"IF(B$25=\"N/A$\",\"Grey\",T41)","v":"Grey"},"Green - Yellow - Orange - Brown - Red",null,null,null,null,null,null,null,null,null,null,null,null,null,null,null,null,{"$f":"SUM(T29:U39)/(2*SUM($S$29:$S$39))","v":{"$error":"#N/A"}},null,{"$f":"SUM(V29:V39)/(SUM($S$29:$S$39))","v":{"$error":"#N/A"}},{"$f":"SUM(W29:X39)/(2*SUM($S$29:$S$39))","v":{"$error":"#N/A"}}]
["DRW_Approaching a slower moving car - right overlap",{"$f":"IF(B$25=\"N/A$\",\"Grey\",W55)","v":"Grey"},"Green - Yellow - Orange - Brown - Red",null,null,null,null,null,null,null,null,"CCRm",null,null,null,null,null,null,null,{"$f":"IF(T40>=0.75,\"Green\",IF(T40>=0.5,\"Yellow\",IF(T40>=0.25,\"Orange\",IF(T40>0,\"Brown\",\"Red\"))))","v":{"$error":"#N/A"}},null,{"$f":"IF(V40>=0.75,\"Green\",IF(V40>=0.5,\"Yellow\",IF(V40>=0.25,\"Orange\",IF(V40>0,\"Brown\",\"Red\"))))","v":{"$error":"#N/A"}},{"$f":"IF(W40>=0.75,\"Green\",IF(W40>=0.5,\"Yellow\",IF(W40>=0.25,\"Orange\",IF(W40>0,\"Brown\",\"Red\"))))","v":{"$error":"#N/A"}}]
["DRW_Approaching a slower moving car - no overlap",{"$f":"IF(B$25=\"N/A$\",\"Grey\",V55)","v":"Grey"},"Green - Yellow - Orange - Brown - Red",null,null,null,null,null,null,null,null,"AEB",null,null,null,null,null,null,"FCW"]
["DRW_Approaching a slower moving car - left overlap",{"$f":"IF(B$25=\"N/A$\",\"Grey\",T55)","v":"Grey"},"Green - Yellow - Orange - Brown - Red",null,null,null,null,null,null,null,null,1,{"$f":"VLOOKUP('AEB Car-to-Car'!D36,Summary!$I$28:$J$32,2,0)*$L43","v":{"$error":"#N/A"}},{"$f":"VLOOKUP('AEB Car-to-Car'!E36,Summary!$I$28:$J$32,2,0)*$L43","v":{"$error":"#N/A"}},{"$f":"VLOOKUP('AEB Car-to-Car'!F36,Summary!$I$28:$J$32,2,0)*$L43","v":{"$error":"#N/A"}},{"$f":"VLOOKUP('AEB Car-to-Car'!G36,Summary!$I$28:$J$32,2,0)*$L43","v":{"$error":"#N/A"}},{"$f":"VLOOKUP('AEB Car-to-Car'!H36,Summary!$I$28:$J$32,2,0)*$L43","v":{"$error":"#N/A"}}]
["DRW_Approaching a braking car",{"$f":"IF(B43=\"#N/A\",\"N/A#\",IF(B$25=\"N/A$\",\"Grey\",IF('AEB Car-to-Car'!I57>=0.75,\"Green\",IF('AEB Car-to-Car'!I57>=0.5,\"Yellow\",IF('AEB Car-to-Car'!I57>=0.25,\"Orange\",IF('AEB Car-to-Car'!I57>0,\"Brown\",\"Red\"))))))","v":"Grey"},"Green - Yellow - Orange - Brown - Red",null,null,null,null,null,null,null,null,1,{"$f":"VLOOKUP('AEB Car-to-Car'!D37,Summary!$I$28:$J$32,2,0)*$L44","v":{"$error":"#N/A"}},{"$f":"VLOOKUP('AEB Car-to-Car'!E37,Summary!$I$28:$J$32,2,0)*$L44","v":{"$error":"#N/A"}},{"$f":"VLOOKUP('AEB Car-to-Car'!F37,Summary!$I$28:$J$32,2,0)*$L44","v":{"$error":"#N/A"}},{"$f":"VLOOKUP('AEB Car-to-Car'!G37,Summary!$I$28:$J$32,2,0)*$L44","v":{"$error":"#N/A"}},{"$f":"VLOOKUP('AEB Car-to-Car'!H37,Summary!$I$28:$J$32,2,0)*$L44","v":{"$error":"#N/A"}}]
["AEB Pedestrian - score",{"$f":"IF(B17=\"n/a\",\"N/A$\",'OVERALL RATING'!G7)","v":"N/A$"},"number - 1 decimal",null,null,null,null,null,null,null,null,1,{"$f":"VLOOKUP('AEB Car-to-Car'!D38,Summary!$I$28:$J$32,2,0)*$L45","v":{"$error":"#N/A"}},{"$f":"VLOOKUP('AEB Car-to-Car'!E38,Summary!$I$28:$J$32,2,0)*$L45","v":{"$error":"#N/A"}},{"$f":"VLOOKUP('AEB Car-to-Car'!F38,Summary!$I$28:$J$32,2,0)*$L45","v":{"$error":"#N/A"}},{"$f":"VLOOKUP('AEB Car-to-Car'!G38,Summary!$I$28:$J$32,2,0)*$L45","v":{"$error":"#N/A"}},{"$f":"VLOOKUP('AEB Car-to-Car'!H38,Summary!$I$28:$J$32,2,0)*$L45","v":{"$error":"#N/A"}}]
["AEB Pedestrian - colour",{"$f":"IF(B17=\"N/A\",\"Grey\",IF(B45/10>=0.75,\"Green\",IF(B45/10>=0.5,\"Yellow\",IF(B45/10>=0.25,\"Orange\",IF(B45/10>0,\"Brown\",\"Red\")))))","v":"Grey"},"Green - Yellow - Orange - Brown - Red",null,null,null,null,null,null,null,null,1,{"$f":"VLOOKUP('AEB Car-to-Car'!D39,Summary!$I$28:$J$32,2,0)*$L46","v":{"$error":"#N/A"}},{"$f":"VLOOKUP('AEB Car-to-Car'!E39,Summary!$I$28:$J$32,2,0)*$L46","v":{"$error":"#N/A"}},{"$f":"VLOOKUP('AEB Car-to-Car'!F39,Summary!$I$28:$J$32,2,0)*$L46","v":{"$error":"#N/A"}},{"$f":"VLOOKUP('AEB Car-to-Car'!G39,Summary!$I$28:$J$32,2,0)*$L46","v":{"$error":"#N/A"}},{"$f":"VLOOKUP('AEB Car-to-Car'!H39,Summary!$I$28:$J$32,2,0)*$L46","v":{"$error":"#N/A"}}]
["Adult crossing the road",{"$f":"IF(B$45=\"N/A$\",\"Grey\",IF(AVERAGE('AEB Pedestrian'!D90:E92)>=0.75,\"Green\",IF(AVERAGE('AEB Pedestrian'!D90:E92)>=0.5,\"Yellow\",IF(AVERAGE('AEB Pedestrian'!D90:E92)>=0.25,\"Orange\",IF(AVERAGE('AEB Pedestrian'!D90:E92)>0,\"Brown\",\"Red\")))))","v":"Grey"},"Green - Yellow - Orange - Brown - Red",null,null,null,null,null,null,null,null,1,{"$f":"VLOOKUP('AEB Car-to-Car'!D40,Summary!$I$28:$J$32,2,0)*$L47","v":{"$error":"#N/A"}},{"$f":"VLOOKUP('AEB Car-to-Car'!E40,Summary!$I$28:$J$32,2,0)*$L47","v":{"$error":"#N/A"}},{"$f":"VLOOKUP('AEB Car-to-Car'!F40,Summary!$I$28:$J$32,2,0)*$L47","v":{"$error":"#N/A"}},{"$f":"VLOOKUP('AEB Car-to-Car'!G40,Summary!$I$28:$J$32,2,0)*$L47","v":{"$error":"#N/A"}},{"$f":"VLOOKUP('AEB Car-to-Car'!H40,Summary!$I$28:$J$32,2,0)*$L47","v":{"$error":"#N/A"}},null,1,{"$f":"VLOOKUP('AEB Car-to-Car'!I40,Summary!$I$28:$J$32,2,0)*$S47","v":{"$error":"#N/A"}},{"$f":"VLOOKUP('AEB Car-to-Car'!J40,Summary!$I$28:$J$32,2,0)*$S47","v":{"$error":"#N/A"}},{"$f":"VLOOKUP('AEB Car-to-Car'!K40,Summary!$I$28:$J$32,2,0)*$S47","v":{"$error":"#N/A"}},{"$f":"VLOOKUP('AEB Car-to-Car'!L40,Summary!$I$28:$J$32,2,0)*$S47","v":{"$error":"#N/A"}},{"$f":"VLOOKUP('AEB Car-to-Car'!M40,Summary!$I$28:$J$32,2,0)*$S47","v":{"$error":"#N/A"}}]
["Child running from behind parked vehicles",{"$f":"IF(B$45=\"N/A$\",\"Grey\",IF('AEB Pedestrian'!D93>=0.75,\"Green\",IF('AEB Pedestrian'!D93>=0.5,\"Yellow\",IF('AEB Pedestrian'!D93>=0.25,\"Orange\",IF('AEB Pedestrian'!D93>0,\"Brown\",\"Red\")))))","v":"Grey"},"Green - Yellow - Orange - Brown - Red",null,null,null,null,null,null,null,null,1,{"$f":"VLOOKUP('AEB Car-to-Car'!D41,Summary!$I$28:$J$32,2,0)*$L48","v":{"$error":"#N/A"}},{"$f":"VLOOKUP('AEB Car-to-Car'!E41,Summary!$I$28:$J$32,2,0)*$L48","v":{"$error":"#N/A"}},{"$f":"VLOOKUP('AEB Car-to-Car'!F41,Summary!$I$28:$J$32,2,0)*$L48","v":{"$error":"#N/A"}},{"$f":"VLOOKUP('AEB Car-to-Car'!G41,Summary!$I$28:$J$32,2,0)*$L48","v":{"$error":"#N/A"}},{"$f":"VLOOKUP('AEB Car-to-Car'!H41,Summary!$I$28:$J$32,2,0)*$L48","v":{"$error":"#N/A"}},null,1,{"$f":"VLOOKUP('AEB Car-to-Car'!I41,Summary!$I$28:$J$32,2,0)*$S48","v":{"$error":"#N/A"}},{"$f":"VLOOKUP('AEB Car-to-Car'!J41,Summary!$I$28:$J$32,2,0)*$S48","v":{"$error":"#N/A"}},{"$f":"VLOOKUP('AEB Car-to-Car'!K41,Summary!$I$28:$J$32,2,0)*$S48","v":{"$error":"#N/A"}},{"$f":"VLOOKUP('AEB Car-to-Car'!L41,Summary!$I$28:$J$32,2,0)*$S48","v":{"$error":"#N/A"}},{"$f":"VLOOKUP('AEB Car-to-Car'!M41,Summary!$I$28:$J$32,2,0)*$S48","v":{"$error":"#N/A"}}]
["Adult along the roadside",{"$f":"IF(B$45=\"N/A$\",\"Grey\",IF('AEB Pedestrian'!D94>=0.75,\"Green\",IF('AEB Pedestrian'!D94>=0.5,\"Yellow\",IF('AEB Pedestrian'!D94>=0.25,\"Orange\",IF('AEB Pedestrian'!D94>0,\"Brown\",\"Red\")))))","v":"Grey"},"Green - Yellow - Orange - Brown - Red",null,null,null,null,null,null,null,null,1,{"$f":"VLOOKUP('AEB Car-to-Car'!D42,Summary!$I$28:$J$32,2,0)*$L49","v":{"$error":"#N/A"}},{"$f":"VLOOKUP('AEB Car-to-Car'!E42,Summary!$I$28:$J$32,2,0)*$L49","v":{"$error":"#N/A"}},{"$f":"VLOOKUP('AEB Car-to-Car'!F42,Summary!$I$28:$J$32,2,0)*$L49","v":{"$error":"#N/A"}},{"$f":"VLOOKUP('AEB Car-to-Car'!G42,Summary!$I$28:$J$32,2,0)*$L49","v":{"$error":"#N/A"}},{"$f":"VLOOKUP('AEB Car-to-Car'!H42,Summary!$I$28:$J$32,2,0)*$L49","v":{"$error":"#N/A"}},null,1,{"$f":"VLOOKUP('AEB Car-to-Car'!I42,Summary!$I$28:$J$32,2,0)*$S49","v":{"$error":"#N/A"}},{"$f":"VLOOKUP('AEB Car-to-Car'!J42,Summary!$I$28:$J$32,2,0)*$S49","v":{"$error":"#N/A"}},{"$f":"VLOOKUP('AEB Car-to-Car'!K42,Summary!$I$28:$J$32,2,0)*$S49","v":{"$error":"#N/A"}},{"$f":"VLOOKUP('AEB Car-to-Car'!L42,Summary!$I$28:$J$32,2,0)*$S49","v":{"$error":"#N/A"}},{"$f":"VLOOKUP('AEB Car-to-Car'!M42,Summary!$I$28:$J$32,2,0)*$S49","v":{"$error":"#N/A"}}]
["AEB Cyclist - score",{"$f":"IF(B18=\"n/a\",\"N/A$\",'OVERALL RATING'!G8)","v":"N/A$"},"number - 1 decimal",null,null,null,null,null,null,null,null,2,{"$f":"VLOOKUP('AEB Car-to-Car'!D43,Summary!$I$28:$J$32,2,0)*$L50","v":{"$error":"#N/A"}},{"$f":"VLOOKUP('AEB Car-to-Car'!E43,Summary!$I$28:$J$32,2,0)*$L50","v":{"$error":"#N/A"}},{"$f":"VLOOKUP('AEB Car-to-Car'!F43,Summary!$I$28:$J$32,2,0)*$L50","v":{"$error":"#N/A"}},{"$f":"VLOOKUP('AEB Car-to-Car'!G43,Summary!$I$28:$J$32,2,0)*$L50","v":{"$error":"#N/A"}},{"$f":"VLOOKUP('AEB Car-to-Car'!H43,Summary!$I$28:$J$32,2,0)*$L50","v":{"$error":"#N/A"}},null,2,{"$f":"VLOOKUP('AEB Car-to-Car'!I43,Summary!$I$28:$J$32,2,0)*$S50","v":{"$error":"#N/A"}},{"$f":"VLOOKUP('AEB Car-to-Car'!J43,Summary!$I$28:$J$32,2,0)*$S50","v":{"$error":"#N/A"}},{"$f":"VLOOKUP('AEB Car-to-Car'!K43,Summary!$I$28:$J$32,2,0)*$S50","v":{"$error":"#N/A"}},{"$f":"VLOOKUP('AEB Car-to-Car'!L43,Summary!$I$28:$J$32,2,0)*$S50","v":{"$error":"#N/A"}},{"$f":"VLOOKUP('AEB Car-to-Car'!M43,Summary!$I$28:$J$32,2,0)*$S50","v":{"$error":"#N/A"}}]
["AEB Cyclist - colour",{"$f":"IF(B18=\"N/A\",\"Grey\",IF(B50/10>=0.75,\"Green\",IF(B50/10>=0.5,\"Yellow\",IF(B50/10>=0.25,\"Orange\",IF(B50/10>0,\"Brown\",\"Red\")))))","v":"Grey"},"Green - Yellow - Orange - Brown - Red",null,null,null,null,null,null,null,null,2,{"$f":"VLOOKUP('AEB Car-to-Car'!D44,Summary!$I$28:$J$32,2,0)*$L51","v":{"$error":"#N/A"}},{"$f":"VLOOKUP('AEB Car-to-Car'!E44,Summary!$I$28:$J$32,2,0)*$L51","v":{"$error":"#N/A"}},{"$f":"VLOOKUP('AEB Car-to-Car'!F44,Summary!$I$28:$J$32,2,0)*$L51","v":{"$error":"#N/A"}},{"$f":"VLOOKUP('AEB Car-to-Car'!G44,Summary!$I$28:$J$32,2,0)*$L51","v":{"$error":"#N/A"}},{"$f":"VLOOKUP('AEB Car-to-Car'!H44,Summary!$I$28:$J$32,2,0)*$L51","v":{"$error":"#N/A"}},null,2,{"$f":"VLOOKUP('AEB Car-to-Car'!I44,Summary!$I$28:$J$32,2,0)*$S51","v":{"$error":"#N/A"}},{"$f":"VLOOKUP('AEB Car-to-Car'!J44,Summary!$I$28:$J$32,2,0)*$S51","v":{"$error":"#N/A"}},{"$f":"VLOOKUP('AEB Car-to-Car'!K44,Summary!$I$28:$J$32,2,0)*$S51","v":{"$error":"#N/A"}},{"$f":"VLOOKUP('AEB Car-to-Car'!L44,Summary!$I$28:$J$32,2,0)*$S51","v":{"$error":"#N/A"}},{"$f":"VLOOKUP('AEB Car-to-Car'!M44,Summary!$I$28:$J$32,2,0)*$S51","v":{"$error":"#N/A"}}]
["Cyclist crossing",{"$f":"IF(B$50=\"N/A$\",\"Grey\",IF(AND(IF('AEB Cyclist'!D51>=0.75,\"Green\",IF('AEB Cyclist'!D51>=0.5,\"Yellow\",IF('AEB Cyclist'!D51>=0.25,\"Orange\",IF('AEB Cyclist'!D51>0,\"Brown\",\"Red\"))))=\"Red\",B50=\"N/A\"),\"Grey\",IF('AEB Cyclist'!D51>=0.75,\"Green\",IF('AEB Cyclist'!D51>=0.5,\"Yellow\",IF('AEB Cyclist'!D51>=0.25,\"Orange\",IF('AEB Cyclist'!D51>0,\"Brown\",\"Red\"))))))","v":"Grey"},"Green - Yellow - Orange - Brown - Red",null,null,null,null,null,null,null,null,2,{"$f":"VLOOKUP('AEB Car-to-Car'!D45,Summary!$I$28:$J$32,2,0)*$L52","v":{"$error":"#N/A"}},{"$f":"VLOOKUP('AEB Car-to-Car'!E45,Summary!$I$28:$J$32,2,0)*$L52","v":{"$error":"#N/A"}},{"$f":"VLOOKUP('AEB Car-to-Car'!F45,Summary!$I$28:$J$32,2,0)*$L52","v":{"$error":"#N/A"}},{"$f":"VLOOKUP('AEB Car-to-Car'!G45,Summary!$I$28:$J$32,2,0)*$L52","v":{"$error":"#N/A"}},{"$f":"VLOOKUP('AEB Car-to-Car'!H45,Summary!$I$28:$J$32,2,0)*$L52","v":{"$error":"#N/A"}},null,2,{"$f":"VLOOKUP('AEB Car-to-Car'!I45,Summary!$I$28:$J$32,2,0)*$S52","v":{"$error":"#N/A"}},{"$f":"VLOOKUP('AEB Car-to-Car'!J45,Summary!$I$28:$J$32,2,0)*$S52","v":{"$error":"#N/A"}},{"$f":"VLOOKUP('AEB Car-to-Car'!K45,Summary!$I$28:$J$32,2,0)*$S52","v":{"$error":"#N/A"}},{"$f":"VLOOKUP('AEB Car-to-Car'!L45,Summary!$I$28:$J$32,2,0)*$S52","v":{"$error":"#N/A"}},{"$f":"VLOOKUP('AEB Car-to-Car'!M45,Summary!$I$28:$J$32,2,0)*$S52","v":{"$error":"#N/A"}}]
["Cyclist along the roadside",{"$f":"IF(B$50=\"N/A$\",\"Grey\",IF(AND(IF('AEB Cyclist'!D52>=0.75,\"Green\",IF('AEB Cyclist'!D52>=0.5,\"Yellow\",IF('AEB Cyclist'!D52>=0.25,\"Orange\",IF('AEB Cyclist'!D52>0,\"Brown\",\"Red\"))))=\"Red\",B50=\"N/A\"),\"Grey\",IF('AEB Cyclist'!D52>=0.75,\"Green\",IF('AEB Cyclist'!D52>=0.5,\"Yellow\",IF('AEB Cyclist'!D52>=0.25,\"Orange\",IF('AEB Cyclist'!D52>0,\"Brown\",\"Red\"))))))","v":"Grey"},"Green - Yellow - Orange - Brown - Red",null,null,null,null,null,null,null,null,2,{"$f":"VLOOKUP('AEB Car-to-Car'!D46,Summary!$I$28:$J$32,2,0)*$L53","v":{"$error":"#N/A"}},{"$f":"VLOOKUP('AEB Car-to-Car'!E46,Summary!$I$28:$J$32,2,0)*$L53","v":{"$error":"#N/A"}},{"$f":"VLOOKUP('AEB Car-to-Car'!F46,Summary!$I$28:$J$32,2,0)*$L53","v":{"$error":"#N/A"}},{"$f":"VLOOKUP('AEB Car-to-Car'!G46,Summary!$I$28:$J$32,2,0)*$L53","v":{"$error":"#N/A"}},{"$f":"VLOOKUP('AEB Car-to-Car'!H46,Summary!$I$28:$J$32,2,0)*$L53","v":{"$error":"#N/A"}},null,2,{"$f":"VLOOKUP('AEB Car-to-Car'!I46,Summary!$I$28:$J$32,2,0)*$S53","v":{"$error":"#N/A"}},{"$f":"VLOOKUP('AEB Car-to-Car'!J46,Summary!$I$28:$J$32,2,0)*$S53","v":{"$error":"#N/A"}},{"$f":"VLOOKUP('AEB Car-to-Car'!K46,Summary!$I$28:$J$32,2,0)*$S53","v":{"$error":"#N/A"}},{"$f":"VLOOKUP('AEB Car-to-Car'!L46,Summary!$I$28:$J$32,2,0)*$S53","v":{"$error":"#N/A"}},{"$f":"VLOOKUP('AEB Car-to-Car'!M46,Summary!$I$28:$J$32,2,0)*$S53","v":{"$error":"#N/A"}}]
["Speed assistance - score",{"$f":"IF(B21=\"N/A\",\"N/A$\",'OVERALL RATING'!G10)","v":"N/A$"},"number - 1 decimal",null,null,null,null,null,null,null,null,null,{"$f":"SUM(M43:N53)/(2*SUM($L$43:$L$53))","v":{"$error":"#N/A"}},null,{"$f":"SUM(O43:O53)/(SUM($L$43:$L$53))","v":{"$error":"#N/A"}},{"$f":"SUM(P43:Q53)/(2*SUM($L$43:$L$53))","v":{"$error":"#N/A"}},null,null,null,{"$f":"SUM(T43:U53)/(2*SUM($S$43:$S$53))","v":{"$error":"#N/A"}},null,{"$f":"SUM(V43:V53)/(SUM($S$43:$S$53))","v":{"$error":"#N/A"}},{"$f":"SUM(W43:X53)/(2*SUM($S$43:$S$53))","v":{"$error":"#N/A"}}]
["Speed assistance - colour",{"$f":"IF(B54=\"N/A$\",\"Grey\",IF(B54/15>=0.75,\"Green\",IF(B54/15>=0.5,\"Yellow\",IF(B54/15>=0.25,\"Orange\",IF(B54/15>0,\"Brown\",\"Red\")))))","v":"Grey"},"Green - Yellow - Orange - Brown - Red",null,null,null,null,null,null,null,null,null,{"$f":"IF(M54>=0.75,\"Green\",IF(M54>=0.5,\"Yellow\",IF(M54>=0.25,\"Orange\",IF(M54>0,\"Brown\",\"Red\"))))","v":{"$error":"#N/A"}},null,{"$f":"IF(O54>=0.75,\"Green\",IF(O54>=0.5,\"Yellow\",IF(O54>=0.25,\"Orange\",IF(O54>0,\"Brown\",\"Red\"))))","v":{"$error":"#N/A"}},{"$f":"IF(P54>=0.75,\"Green\",IF(P54>=0.5,\"Yellow\",IF(P54>=0.25,\"Orange\",IF(P54>0,\"Brown\",\"Red\"))))","v":{"$error":"#N/A"}},null,null,null,{"$f":"IF(T54>=0.75,\"Green\",IF(T54>=0.5,\"Yellow\",IF(T54>=0.25,\"Orange\",IF(T54>0,\"Brown\",\"Red\"))))","v":{"$error":"#N/A"}},null,{"$f":"IF(V54>=0.75,\"Green\",IF(V54>=0.5,\"Yellow\",IF(V54>=0.25,\"Orange\",IF(V54>0,\"Brown\",\"Red\"))))","v":{"$error":"#N/A"}},{"$f":"IF(W54>=0.75,\"Green\",IF(W54>=0.5,\"Yellow\",IF(W54>=0.25,\"Orange\",IF(W54>0,\"Brown\",\"Red\"))))","v":{"$error":"#N/A"}}]
["SA_Speed limit information function",{"$f":"IF(SAS!D10=0,\" \",SAS!D10)","v":" "},"text"]
["SA_Speed limitation function",{"$f":"IF(SAS!D31=0,\" \",SAS!D31)","v":" "},"text"]
["OSM - score",{"$f":"IF(FITMENT!G47=\"N/A\",\"N/A$\",'OVERALL RATING'!G11)","v":"N/A$"},"number - 1 decimal"]
["OSM - colour",{"$f":"IF(B58=\"N/A$\",\"Grey\",IF(B58/15>=0.75,\"Green\",IF(B58/15>=0.5,\"Yellow\",IF(B58/15>=0.25,\"Orange\",IF(B58/15>0,\"Brown\",\"Red\")))))","v":"Grey"},"Green - Yellow - Orange - Brown - Red"]
["OSM_Attention Assist Driver",{"$f":"IF('N1 Fitment'!T34=\"N/A\",\"N/A\",IF(OSM!D14>0,\"Pass\",\"Fail\"))","v":"N/A"},"pass/fail/not available"]
["OSM_Driver seat - visual",{"$f":"OSM!D7","v":0},"pass/fail/not available"]
["OSM_Driver seat - audible",{"$f":"OSM!D8","v":0},"pass/fail/not available"]
["OSM_Front Passenger - visual",{"$f":"OSM!F7","v":0},"pass/fail/not available"]
["OSM_Front Passenger - audible",{"$f":"OSM!F8","v":0},"pass/fail/not available"]
["OSM_Front Passenger - occupant detection",{"$f":"OSM!F6","v":0},"pass/fail/not available"]
["Lane Support - score",{"$f":"IF(B20=\"N/A\",\"N/A$\",'OVERALL RATING'!G9)","v":"N/A$"},"number - 1 decimal"]
["Lane Support - colour",{"$f":"IF(B66=\"N/A$\",\"Grey\",IF(B66/20>=0.75,\"Green\",IF(B66/20>=0.5,\"Yellow\",IF(B66/20>=0.25,\"Orange\",IF(B66/20>0,\"Brown\",\"Red\")))))","v":"Grey"},"Green - Yellow - Orange - Brown - Red"]
["LSS_Type",{"$f":"CONCATENATE(IF('N1 Fitment'!Q34<>\"N/A\",\"ELK/LKA\",\"\"),IF(AND('N1 Fitment'!Q34<>\"N/A\",'N1 Fitment'!R34<>\"N/A\",'N1 Fitment'!S34=\"N/A\"),\" & \",\"\"),IF(AND('N1 Fitment'!Q34<>\"N/A\",'N1 Fitment'!R34<>\"N/A\",'N1 Fitment'!S34<>\"N/A\"),\", \",\"\"),IF('N1 Fitment'!R34<>\"N/A\",\"LDW\",\"\"),IF(AND('N1 Fitment'!S34<>\"N/A\",'N1 Fitment'!S34<>\"N/A\"),\" & \",\"\"),IF('N1 Fitment'!S34<>\"N/A\",\"BLIS\",\"\"))","v":""},"text"]
["LSS_Operational from",{"$f":"LSS!D8","v":0},"text"]
["LSS_Emergency lane keeping",{"$f":"IF('N1 Fitment'!Q34=\"N/A\",\"White\",IF((LSS!D86+LSS!D87)/3.5>=0.75,\"Green\",IF((LSS!D86+LSS!D87)/3.5>=0.5,\"Yellow\",IF((LSS!D86+LSS!D87)/3.5>=0.25,\"Orange\",IF((LSS!D86+LSS!D87)/3.5>0,\"Brown\",\"Red\")))))","v":"White"},"Green - Yellow - Orange - Brown - Red"]
["LSS_Lane Departure Warning",{"$f":"IF('N1 Fitment'!R34=\"N/A\",\"N/A\",LSS!D78)","v":"N/A"},"pass/fail/not available"]
["LSS_Blind Spot Information System",{"$f":"IF('N1 Fitment'!S34=\"N/A\",\"N/A\",LSS!D82)","v":"N/A"},"pass/fail/not available"]
["Fitment"]
["AEB Car-to-Car_AT",{"$f":"'N1 Fitment'!N6","v":0},"standard/optional/not available"]
["AEB Car-to-Car_BE",{"$f":"'N1 Fitment'!N7","v":0},"standard/optional/not available"]
["AEB Car-to-Car_BG",{"$f":"'N1 Fitment'!N8","v":0},"standard/optional/not available"]
["AEB Car-to-Car_HR",{"$f":"'N1 Fitment'!N9","v":0},"standard/optional/not available"]
["AEB Car-to-Car_CY",{"$f":"'N1 Fitment'!N10","v":0},"standard/optional/not available"]
["AEB Car-to-Car_CZ",{"$f":"'N1 Fitment'!N11","v":0},"standard/optional/not available"]
["AEB Car-to-Car_DK",{"$f":"'N1 Fitment'!N12","v":0},"standard/optional/not available"]
["AEB Car-to-Car_EE",{"$f":"'N1 Fitment'!N13","v":0},"standard/optional/not available"]
["AEB Car-to-Car_FI",{"$f":"'N1 Fitment'!N14","v":0},"standard/optional/not available"]
["AEB Car-to-Car_FR",{"$f":"'N1 Fitment'!N15","v":0},"standard/optional/not available"]
["AEB Car-to-Car_DE",{"$f":"'N1 Fitment'!N16","v":0},"standard/optional/not available"]
["AEB Car-to-Car_GR",{"$f":"'N1 Fitment'!N17","v":0},"standard/optional/not available"]
["AEB Car-to-Car_HU",{"$f":"'N1 Fitment'!N18","v":0},"standard/optional/not available"]
["AEB Car-to-Car_IE",{"$f":"'N1 Fitment'!N19","v":0},"standard/optional/not available"]
["AEB Car-to-Car_IT",{"$f":"'N1 Fitment'!N20","v":0},"standard/optional/not available"]
["AEB Car-to-Car_LV",{"$f":"'N1 Fitment'!N21","v":0},"standard/optional/not available"]
["AEB Car-to-Car_LT",{"$f":"'N1 Fitment'!N22","v":0},"standard/optional/not available"]
["AEB Car-to-Car_LU",{"$f":"'N1 Fitment'!N23","v":0},"standard/optional/not available"]
["AEB Car-to-Car_MT",{"$f":"'N1 Fitment'!N24","v":0},"standard/optional/not available"]
["AEB Car-to-Car_NL",{"$f":"'N1 Fitment'!N25","v":0},"standard/optional/not available"]
["AEB Car-to-Car_PL",{"$f":"'N1 Fitment'!N26","v":0},"standard/optional/not available"]
["AEB Car-to-Car_PT",{"$f":"'N1 Fitment'!N27","v":0},"standard/optional/not available"]
["AEB Car-to-Car_RO",{"$f":"'N1 Fitment'!N28","v":0},"standard/optional/not available"]
["AEB Car-to-Car_SK",{"$f":"'N1 Fitment'!N29","v":0},"standard/optional/not available"]
["AEB Car-to-Car_SI",{"$f":"'N1 Fitment'!N30","v":0},"standard/optional/not available"]
["AEB Car-to-Car_ES",{"$f":"'N1 Fitment'!N31","v":0},"standard/optional/not available"]
["AEB Car-to-Car_SE",{"$f":"'N1 Fitment'!N32","v":0},"standard/optional/not available"]
["AEB Car-to-Car_GB",{"$f":"'N1 Fitment'!N33","v":0},"standard/optional/not available"]
["AEB Pedestrian_AT",{"$f":"'N1 Fitment'!O6","v":0},"standard/optional/not available"]
["AEB Pedestrian_BE",{"$f":"'N1 Fitment'!O7","v":0},"standard/optional/not available"]
["AEB Pedestrian_BG",{"$f":"'N1 Fitment'!O8","v":0},"standard/optional/not available"]
["AEB Pedestrian_HR",{"$f":"'N1 Fitment'!O9","v":0},"standard/optional/not available"]
["AEB Pedestrian_CY",{"$f":"'N1 Fitment'!O10","v":0},"standard/optional/not available"]
["AEB Pedestrian_CZ",{"$f":"'N1 Fitment'!O11","v":0},"standard/optional/not available"]
["AEB Pedestrian_DK",{"$f":"'N1 Fitment'!O12","v":0},"standard/optional/not available"]
["AEB Pedestrian_EE",{"$f":"'N1 Fitment'!O13","v":0},"standard/optional/not available"]
["AEB Pedestrian_FI",{"$f":"'N1 Fitment'!O14","v":0},"standard/optional/not available"]
["AEB Pedestrian_FR",{"$f":"'N1 Fitment'!O15","v":0},"standard/optional/not available"]
["AEB Pedestrian_DE",{"$f":"'N1 Fitment'!O16","v":0},"standard/optional/not available"]
["AEB Pedestrian_GR",{"$f":"'N1 Fitment'!O17","v":0},"standard/optional/not available"]
["AEB Pedestrian_HU",{"$f":"'N1 Fitment'!O18","v":0},"standard/optional/not available"]
["AEB Pedestrian_IE",{"$f":"'N1 Fitment'!O19","v":0},"standard/optional/not available"]
["AEB Pedestrian_IT",{"$f":"'N1 Fitment'!O20","v":0},"standard/optional/not available"]
["AEB Pedestrian_LV",{"$f":"'N1 Fitment'!O21","v":0},"standard/optional/not available"]
["AEB Pedestrian_LT",{"$f":"'N1 Fitment'!O22","v":0},"standard/optional/not available"]
["AEB Pedestrian_LU",{"$f":"'N1 Fitment'!O23","v":0},"standard/optional/not available"]
["AEB Pedestrian_MT",{"$f":"'N1 Fitment'!O24","v":0},"standard/optional/not available"]
["AEB Pedestrian_NL",{"$f":"'N1 Fitment'!O25","v":0},"standard/optional/not available"]
["AEB Pedestrian_PL",{"$f":"'N1 Fitment'!O26","v":0},"standard/optional/not available"]
["AEB Pedestrian_PT",{"$f":"'N1 Fitment'!O27","v":0},"standard/optional/not available"]
["AEB Pedestrian_RO",{"$f":"'N1 Fitment'!O28","v":0},"standard/optional/not available"]
["AEB Pedestrian_SK",{"$f":"'N1 Fitment'!O29","v":0},"standard/optional/not available"]
["AEB Pedestrian_SI",{"$f":"'N1 Fitment'!O30","v":0},"standard/optional/not available"]
["AEB Pedestrian_ES",{"$f":"'N1 Fitment'!O31","v":0},"standard/optional/not available"]
["AEB Pedestrian_SE",{"$f":"'N1 Fitment'!O32","v":0},"standard/optional/not available"]
["AEB Pedestrian_GB",{"$f":"'N1 Fitment'!O33","v":0},"standard/optional/not available"]
["AEB Cyclist_AT",{"$f":"'N1 Fitment'!P6","v":0},"standard/optional/not available"]
["AEB Cyclist_BE",{"$f":"'N1 Fitment'!P7","v":0},"standard/optional/not available"]
["AEB Cyclist_BG",{"$f":"'N1 Fitment'!P8","v":0},"standard/optional/not available"]
["AEB Cyclist_HR",{"$f":"'N1 Fitment'!P9","v":0},"standard/optional/not available"]
["AEB Cyclist_CY",{"$f":"'N1 Fitment'!P10","v":0},"standard/optional/not available"]
["AEB Cyclist_CZ",{"$f":"'N1 Fitment'!P11","v":0},"standard/optional/not available"]
["AEB Cyclist_DK",{"$f":"'N1 Fitment'!P12","v":0},"standard/optional/not available"]
["AEB Cyclist_EE",{"$f":"'N1 Fitment'!P13","v":0},"standard/optional/not available"]
["AEB Cyclist_FI",{"$f":"'N1 Fitment'!P14","v":0},"standard/optional/not available"]
["AEB Cyclist_FR",{"$f":"'N1 Fitment'!P15","v":0},"standard/optional/not available"]
["AEB Cyclist_DE",{"$f":"'N1 Fitment'!P16","v":0},"standard/optional/not available"]
["AEB Cyclist_GR",{"$f":"'N1 Fitment'!P17","v":0},"standard/optional/not available"]
["AEB Cyclist_HU",{"$f":"'N1 Fitment'!P18","v":0},"standard/optional/not available"]
["AEB Cyclist_IE",{"$f":"'N1 Fitment'!P19","v":0},"standard/optional/not available"]
["AEB Cyclist_IT",{"$f":"'N1 Fitment'!P20","v":0},"standard/optional/not available"]
["AEB Cyclist_LV",{"$f":"'N1 Fitment'!P21","v":0},"standard/optional/not available"]
["AEB Cyclist_LT",{"$f":"'N1 Fitment'!P22","v":0},"standard/optional/not available"]
["AEB Cyclist_LU",{"$f":"'N1 Fitment'!P23","v":0},"standard/optional/not available"]
["AEB Cyclist_MT",{"$f":"'N1 Fitment'!P24","v":0},"standard/optional/not available"]
["AEB Cyclist_NL",{"$f":"'N1 Fitment'!P25","v":0},"standard/optional/not available"]
["AEB Cyclist_PL",{"$f":"'N1 Fitment'!P26","v":0},"standard/optional/not available"]
["AEB Cyclist_PT",{"$f":"'N1 Fitment'!P27","v":0},"standard/optional/not available"]
["AEB Cyclist_RO",{"$f":"'N1 Fitment'!P28","v":0},"standard/optional/not available"]
["AEB Cyclist_SK",{"$f":"'N1 Fitment'!P29","v":0},"standard/optional/not available"]
["AEB Cyclist_SI",{"$f":"'N1 Fitment'!P30","v":0},"standard/optional/not available"]
["AEB Cyclist_ES",{"$f":"'N1 Fitment'!P31","v":0},"standard/optional/not available"]
["AEB Cyclist_SE",{"$f":"'N1 Fitment'!P32","v":0},"standard/optional/not available"]
["AEB Cyclist_GB",{"$f":"'N1 Fitment'!P33","v":0},"standard/optional/not available"]
["LSS_ELK/LKA_AT",{"$f":"'N1 Fitment'!Q6","v":0},"standard/optional/not available"]
["LSS_ELK/LKA_BE",{"$f":"'N1 Fitment'!Q7","v":0},"standard/optional/not available"]
["LSS_ELK/LKA_BG",{"$f":"'N1 Fitment'!Q8","v":0},"standard/optional/not available"]
["LSS_ELK/LKA_HR",{"$f":"'N1 Fitment'!Q9","v":0},"standard/optional/not available"]
["LSS_ELK/LKA_CY",{"$f":"'N1 Fitment'!Q10","v":0},"standard/optional/not available"]
["LSS_ELK/LKA_CZ",{"$f":"'N1 Fitment'!Q11","v":0},"standard/optional/not available"]
["LSS_ELK/LKA_DK",{"$f":"'N1 Fitment'!Q12","v":0},"standard/optional/not available"]
["LSS_ELK/LKA_EE",{"$f":"'N1 Fitment'!Q13","v":0},"standard/optional/not available"]
["LSS_ELK/LKA_FI",{"$f":"'N1 Fitment'!Q14","v":0},"standard/optional/not available"]
["LSS_ELK/LKA_FR",{"$f":"'N1 Fitment'!Q15","v":0},"standard/optional/not available"]
["LSS_ELK/LKA_DE",{"$f":"'N1 Fitment'!Q16","v":0},"standard/optional/not available"]
["LSS_ELK/LKA_GR",{"$f":"'N1 Fitment'!Q17","v":0},"standard/optional/not available"]
["LSS_ELK/LKA_HU",{"$f":"'N1 Fitment'!Q18","v":0},"standard/optional/not available"]
["LSS_ELK/LKA_IE",{"$f":"'N1 Fitment'!Q19","v":0},"standard/optional/not available"]
["LSS_ELK/LKA_IT",{"$f":"'N1 Fitment'!Q20","v":0},"standard/optional/not available"]
["LSS_ELK/LKA_LV",{"$f":"'N1 Fitment'!Q21","v":0},"standard/optional/not available"]
["LSS_ELK/LKA_LT",{"$f":"'N1 Fitment'!Q22","v":0},"standard/optional/not available"]
["LSS_ELK/LKA_LU",{"$f":"'N1 Fitment'!Q23","v":0},"standard/optional/not available"]
["LSS_ELK/LKA_MT",{"$f":"'N1 Fitment'!Q24","v":0},"standard/optional/not available"]
["LSS_ELK/LKA_NL",{"$f":"'N1 Fitment'!Q25","v":0},"standard/optional/not available"]
["LSS_ELK/LKA_PL",{"$f":"'N1 Fitment'!Q26","v":0},"standard/optional/not available"]
["LSS_ELK/LKA_PT",{"$f":"'N1 Fitment'!Q27","v":0},"standard/optional/not available"]
["LSS_ELK/LKA_RO",{"$f":"'N1 Fitment'!Q28","v":0},"standard/optional/not available"]
["LSS_ELK/LKA_SK",{"$f":"'N1 Fitment'!Q29","v":0},"standard/optional/not available"]
["LSS_ELK/LKA_SI",{"$f":"'N1 Fitment'!Q30","v":0},"standard/optional/not available"]
["LSS_ELK/LKA_ES",{"$f":"'N1 Fitment'!Q31","v":0},"standard/optional/not available"]
["LSS_ELK/LKA_SE",{"$f":"'N1 Fitment'!Q32","v":0},"standard/optional/not available"]
["LSS_ELK/LKA_GB",{"$f":"'N1 Fitment'!Q33","v":0},"standard/optional/not available"]
["LSS_LDW_AT",{"$f":"'N1 Fitment'!R6","v":0},"standard/optional/not available"]
["LSS_LDW_BE",{"$f":"'N1 Fitment'!R7","v":0},"standard/optional/not available"]
["LSS_LDW_BG",{"$f":"'N1 Fitment'!R8","v":0},"standard/optional/not available"]
["LSS_LDW_HR",{"$f":"'N1 Fitment'!R9","v":0},"standard/optional/not available"]
["LSS_LDW_CY",{"$f":"'N1 Fitment'!R10","v":0},"standard/optional/not available"]
["LSS_LDW_CZ",{"$f":"'N1 Fitment'!R11","v":0},"standard/optional/not available"]
["LSS_LDW_DK",{"$f":"'N1 Fitment'!R12","v":0},"standard/optional/not available"]
["LSS_LDW_EE",{"$f":"'N1 Fitment'!R13","v":0},"standard/optional/not available"]
["LSS_LDW_FI",{"$f":"'N1 Fitment'!R14","v":0},"standard/optional/not available"]
["LSS_LDW_FR",{"$f":"'N1 Fitment'!R15","v":0},"standard/optional/not available"]
["LSS_LDW_DE",{"$f":"'N1 Fitment'!R16","v":0},"standard/optional/not available"]
["LSS_LDW_GR",{"$f":"'N1 Fitment'!R17","v":0},"standard/optional/not available"]
["LSS_LDW_HU",{"$f":"'N1 Fitment'!R18","v":0},"standard/optional/not available"]
["LSS_LDW_IE",{"$f":"'N1 Fitment'!R19","v":0},"standard/optional/not available"]
["LSS_LDW_IT",{"$f":"'N1 Fitment'!R20","v":0},"standard/optional/not available"]
["LSS_LDW_LV",{"$f":"'N1 Fitment'!R21","v":0},"standard/optional/not available"]
["LSS_LDW_LT",{"$f":"'N1 Fitment'!R22","v":0},"standard/optional/not available"]
["LSS_LDW_LU",{"$f":"'N1 Fitment'!R23","v":0},"standard/optional/not available"]
["LSS_LDW_MT",{"$f":"'N1 Fitment'!R24","v":0},"standard/optional/not available"]
["LSS_LDW_NL",{"$f":"'N1 Fitment'!R25","v":0},"standard/optional/not available"]
["LSS_LDW_PL",{"$f":"'N1 Fitment'!R26","v":0},"standard/optional/not available"]
["LSS_LDW_PT",{"$f":"'N1 Fitment'!R27","v":0},"standard/optional/not available"]
["LSS_LDW_RO",{"$f":"'N1 Fitment'!R28","v":0},"standard/optional/not available"]
["LSS_LDW_SK",{"$f":"'N1 Fitment'!R29","v":0},"standard/optional/not available"]
["LSS_LDW_SI",{"$f":"'N1 Fitment'!R30","v":0},"standard/optional/not available"]
["LSS_LDW_ES",{"$f":"'N1 Fitment'!R31","v":0},"standard/optional/not available"]
["LSS_LDW_SE",{"$f":"'N1 Fitment'!R32","v":0},"standard/optional/not available"]
["LSS_LDW_GB",{"$f":"'N1 Fitment'!R33","v":0},"standard/optional/not available"]
["LSS_BLIS_AT",{"$f":"'N1 Fitment'!S6","v":0},"standard/optional/not available"]
["LSS_BLIS_BE",{"$f":"'N1 Fitment'!S7","v":0},"standard/optional/not available"]
["LSS_BLIS_BG",{"$f":"'N1 Fitment'!S8","v":0},"standard/optional/not available"]
["LSS_BLIS_HR",{"$f":"'N1 Fitment'!S9","v":0},"standard/optional/not available"]
["LSS_BLIS_CY",{"$f":"'N1 Fitment'!S10","v":0},"standard/optional/not available"]
["LSS_BLIS_CZ",{"$f":"'N1 Fitment'!S11","v":0},"standard/optional/not available"]
["LSS_BLIS_DK",{"$f":"'N1 Fitment'!S12","v":0},"standard/optional/not available"]
["LSS_BLIS_EE",{"$f":"'N1 Fitment'!S13","v":0},"standard/optional/not available"]
["LSS_BLIS_FI",{"$f":"'N1 Fitment'!S14","v":0},"standard/optional/not available"]
["LSS_BLIS_FR",{"$f":"'N1 Fitment'!S15","v":0},"standard/optional/not available"]
["LSS_BLIS_DE",{"$f":"'N1 Fitment'!S16","v":0},"standard/optional/not available"]
["LSS_BLIS_GR",{"$f":"'N1 Fitment'!S17","v":0},"standard/optional/not available"]
["LSS_BLIS_HU",{"$f":"'N1 Fitment'!S18","v":0},"standard/optional/not available"]
["LSS_BLIS_IE",{"$f":"'N1 Fitment'!S19","v":0},"standard/optional/not available"]
["LSS_BLIS_IT",{"$f":"'N1 Fitment'!S20","v":0},"standard/optional/not available"]
["LSS_BLIS_LV",{"$f":"'N1 Fitment'!S21","v":0},"standard/optional/not available"]
["LSS_BLIS_LT",{"$f":"'N1 Fitment'!S22","v":0},"standard/optional/not available"]
["LSS_BLIS_LU",{"$f":"'N1 Fitment'!S23","v":0},"standard/optional/not available"]
["LSS_BLIS_MT",{"$f":"'N1 Fitment'!S24","v":0},"standard/optional/not available"]
["LSS_BLIS_NL",{"$f":"'N1 Fitment'!S25","v":0},"standard/optional/not available"]
["LSS_BLIS_PL",{"$f":"'N1 Fitment'!S26","v":0},"standard/optional/not available"]
["LSS_BLIS_PT",{"$f":"'N1 Fitment'!S27","v":0},"standard/optional/not available"]
["LSS_BLIS_RO",{"$f":"'N1 Fitment'!S28","v":0},"standard/optional/not available"]
["LSS_BLIS_SK",{"$f":"'N1 Fitment'!S29","v":0},"standard/optional/not available"]
["LSS_BLIS_SI",{"$f":"'N1 Fitment'!S30","v":0},"standard/optional/not available"]
["LSS_BLIS_ES",{"$f":"'N1 Fitment'!S31","v":0},"standard/optional/not available"]
["LSS_BLIS_SE",{"$f":"'N1 Fitment'!S32","v":0},"standard/optional/not available"]
["LSS_BLIS_GB",{"$f":"'N1 Fitment'!S33","v":0},"standard/optional/not available"]
["SA_SLIF_AT",{"$f":"'N1 Fitment'!Z6","v":0},"standard/optional/not available"]
["SA_SLIF_BE",{"$f":"'N1 Fitment'!Z7","v":0},"standard/optional/not available"]
["SA_SLIF_BG",{"$f":"'N1 Fitment'!Z8","v":0},"standard/optional/not available"]
["SA_SLIF_HR",{"$f":"'N1 Fitment'!Z9","v":0},"standard/optional/not available"]
["SA_SLIF_CY",{"$f":"'N1 Fitment'!Z10","v":0},"standard/optional/not available"]
["SA_SLIF_CZ",{"$f":"'N1 Fitment'!Z11","v":0},"standard/optional/not available"]
["SA_SLIF_DK",{"$f":"'N1 Fitment'!Z12","v":0},"standard/optional/not available"]
["SA_SLIF_EE",{"$f":"'N1 Fitment'!Z13","v":0},"standard/optional/not available"]
["SA_SLIF_FI",{"$f":"'N1 Fitment'!Z14","v":0},"standard/optional/not available"]
["SA_SLIF_FR",{"$f":"'N1 Fitment'!Z15","v":0},"standard/optional/not available"]
["SA_SLIF_DE",{"$f":"'N1 Fitment'!Z16","v":0},"standard/optional/not available"]
["SA_SLIF_GR",{"$f":"'N1 Fitment'!Z17","v":0},"standard/optional/not available"]
["SA_SLIF_HU",{"$f":"'N1 Fitment'!Z18","v":0},"standard/optional/not available"]
["SA_SLIF_IE",{"$f":"'N1 Fitment'!Z19","v":0},"standard/optional/not available"]
["SA_SLIF_IT",{"$f":"'N1 Fitment'!Z20","v":0},"standard/optional/not available"]
["SA_SLIF_LV",{"$f":"'N1 Fitment'!Z21","v":0},"standard/optional/not available"]
["SA_SLIF_LT",{"$f":"'N1 Fitment'!Z22","v":0},"standard/optional/not available"]
["SA_SLIF_LU",{"$f":"'N1 Fitment'!Z23","v":0},"standard/optional/not available"]
["SA_SLIF_MT",{"$f":"'N1 Fitment'!Z24","v":0},"standard/optional/not available"]
["SA_SLIF_NL",{"$f":"'N1 Fitment'!Z25","v":0},"standard/optional/not available"]
["SA_SLIF_PL",{"$f":"'N1 Fitment'!Z26","v":0},"standard/optional/not available"]
["SA_SLIF_PT",{"$f":"'N1 Fitment'!Z27","v":0},"standard/optional/not available"]
["SA_SLIF_RO",{"$f":"'N1 Fitment'!Z28","v":0},"standard/optional/not available"]
["SA_SLIF_SK",{"$f":"'N1 Fitment'!Z29","v":0},"standard/optional/not available"]
["SA_SLIF_SI",{"$f":"'N1 Fitment'!Z30","v":0},"standard/optional/not available"]
["SA_SLIF_ES",{"$f":"'N1 Fitment'!Z31","v":0},"standard/optional/not available"]
["SA_SLIF_SE",{"$f":"'N1 Fitment'!Z32","v":0},"standard/optional/not available"]
["SA_SLIF_GB",{"$f":"'N1 Fitment'!Z33","v":0},"standard/optional/not available"]
["SA_SCF_AT",{"$f":"'N1 Fitment'!Y6","v":0},"standard/optional/not available"]
["SA_SCF_BE",{"$f":"'N1 Fitment'!Y7","v":0},"standard/optional/not available"]
["SA_SCF_BG",{"$f":"'N1 Fitment'!Y8","v":0},"standard/optional/not available"]
["SA_SCF_HR",{"$f":"'N1 Fitment'!Y9","v":0},"standard/optional/not available"]
["SA_SCF_CY",{"$f":"'N1 Fitment'!Y10","v":0},"standard/optional/not available"]
["SA_SCF_CZ",{"$f":"'N1 Fitment'!Y11","v":0},"standard/optional/not available"]
["SA_SCF_DK",{"$f":"'N1 Fitment'!Y12","v":0},"standard/optional/not available"]
["SA_SCF_EE",{"$f":"'N1 Fitment'!Y13","v":0},"standard/optional/not available"]
["SA_SCF_FI",{"$f":"'N1 Fitment'!Y14","v":0},"standard/optional/not available"]
["SA_SCF_FR",{"$f":"'N1 Fitment'!Y15","v":0},"standard/optional/not available"]
["SA_SCF_DE",{"$f":"'N1 Fitment'!Y16","v":0},"standard/optional/not available"]
["SA_SCF_GR",{"$f":"'N1 Fitment'!Y17","v":0},"standard/optional/not available"]
["SA_SCF_HU",{"$f":"'N1 Fitment'!Y18","v":0},"standard/optional/not available"]
["SA_SCF_IE",{"$f":"'N1 Fitment'!Y19","v":0},"standard/optional/not available"]
["SA_SCF_IT",{"$f":"'N1 Fitment'!Y20","v":0},"standard/optional/not available"]
["SA_SCF_LV",{"$f":"'N1 Fitment'!Y21","v":0},"standard/optional/not available"]
["SA_SCF_LT",{"$f":"'N1 Fitment'!Y22","v":0},"standard/optional/not available"]
["SA_SCF_LU",{"$f":"'N1 Fitment'!Y23","v":0},"standard/optional/not available"]
["SA_SCF_MT",{"$f":"'N1 Fitment'!Y24","v":0},"standard/optional/not available"]
["SA_SCF_NL",{"$f":"'N1 Fitment'!Y25","v":0},"standard/optional/not available"]
["SA_SCF_PL",{"$f":"'N1 Fitment'!Y26","v":0},"standard/optional/not available"]
["SA_SCF_PT",{"$f":"'N1 Fitment'!Y27","v":0},"standard/optional/not available"]
["SA_SCF_RO",{"$f":"'N1 Fitment'!Y28","v":0},"standard/optional/not available"]
["SA_SCF_SK",{"$f":"'N1 Fitment'!Y29","v":0},"standard/optional/not available"]
["SA_SCF_SI",{"$f":"'N1 Fitment'!Y30","v":0},"standard/optional/not available"]
["SA_SCF_ES",{"$f":"'N1 Fitment'!Y31","v":0},"standard/optional/not available"]
["SA_SCF_SE",{"$f":"'N1 Fitment'!Y32","v":0},"standard/optional/not available"]
["SA_SCF_GB",{"$f":"'N1 Fitment'!Y33","v":0},"standard/optional/not available"]
["OSM_SBR Driver_AT",{"$f":"'N1 Fitment'!V6","v":0},"standard/optional/not available"]
["OSM_SBR Driver_BE",{"$f":"'N1 Fitment'!V7","v":0},"standard/optional/not available"]
["OSM_SBR Driver_BG",{"$f":"'N1 Fitment'!V8","v":0},"standard/optional/not available"]
["OSM_SBR Driver_HR",{"$f":"'N1 Fitment'!V9","v":0},"standard/optional/not available"]
["OSM_SBR Driver_CY",{"$f":"'N1 Fitment'!V10","v":0},"standard/optional/not available"]
["OSM_SBR Driver_CZ",{"$f":"'N1 Fitment'!V11","v":0},"standard/optional/not available"]
["OSM_SBR Driver_DK",{"$f":"'N1 Fitment'!V12","v":0},"standard/optional/not available"]
["OSM_SBR Driver_EE",{"$f":"'N1 Fitment'!V13","v":0},"standard/optional/not available"]
["OSM_SBR Driver_FI",{"$f":"'N1 Fitment'!V14","v":0},"standard/optional/not available"]
["OSM_SBR Driver_FR",{"$f":"'N1 Fitment'!V15","v":0},"standard/optional/not available"]
["OSM_SBR Driver_DE",{"$f":"'N1 Fitment'!V16","v":0},"standard/optional/not available"]
["OSM_SBR Driver_GR",{"$f":"'N1 Fitment'!V17","v":0},"standard/optional/not available"]
["OSM_SBR Driver_HU",{"$f":"'N1 Fitment'!V18","v":0},"standard/optional/not available"]
["OSM_SBR Driver_IE",{"$f":"'N1 Fitment'!V19","v":0},"standard/optional/not available"]
["OSM_SBR Driver_IT",{"$f":"'N1 Fitment'!V20","v":0},"standard/optional/not available"]
["OSM_SBR Driver_LV",{"$f":"'N1 Fitment'!V21","v":0},"standard/optional/not available"]
["OSM_SBR Driver_LT",{"$f":"'N1 Fitment'!V22","v":0},"standard/optional/not available"]
["OSM_SBR Driver_LU",{"$f":"'N1 Fitment'!V23","v":0},"standard/optional/not available"]
["OSM_SBR Driver_MT",{"$f":"'N1 Fitment'!V24","v":0},"standard/optional/not available"]
["OSM_SBR Driver_NL",{"$f":"'N1 Fitment'!V25","v":0},"standard/optional/not available"]
["OSM_SBR Driver_PL",{"$f":"'N1 Fitment'!V26","v":0},"standard/optional/not available"]
["OSM_SBR Driver_PT",{"$f":"'N1 Fitment'!V27","v":0},"standard/optional/not available"]
["OSM_SBR Driver_RO",{"$f":"'N1 Fitment'!V28","v":0},"standard/optional/not available"]
["OSM_SBR Driver_SK",{"$f":"'N1 Fitment'!V29","v":0},"standard/optional/not available"]
["OSM_SBR Driver_SI",{"$f":"'N1 Fitment'!V30","v":0},"standard/optional/not available"]
["OSM_SBR Driver_ES",{"$f":"'N1 Fitment'!V31","v":0},"standard/optional/not available"]
["OSM_SBR Driver_SE",{"$f":"'N1 Fitment'!V32","v":0},"standard/optional/not available"]
["OSM_SBR Driver_GB",{"$f":"'N1 Fitment'!V33","v":0},"standard/optional/not available"]
["OSM_SBR Passenger_AT",{"$f":"'N1 Fitment'!X6","v":0},"standard/optional/not available"]
["OSM_SBR Passenger_BE",{"$f":"'N1 Fitment'!X7","v":0},"standard/optional/not available"]
["OSM_SBR Passenger_BG",{"$f":"'N1 Fitment'!X8","v":0},"standard/optional/not available"]
["OSM_SBR Passenger_HR",{"$f":"'N1 Fitment'!X9","v":0},"standard/optional/not available"]
["OSM_SBR Passenger_CY",{"$f":"'N1 Fitment'!X10","v":0},"standard/optional/not available"]
["OSM_SBR Passenger_CZ",{"$f":"'N1 Fitment'!X11","v":0},"standard/optional/not available"]
["OSM_SBR Passenger_DK",{"$f":"'N1 Fitment'!X12","v":0},"standard/optional/not available"]
["OSM_SBR Passenger_EE",{"$f":"'N1 Fitment'!X13","v":0},"standard/optional/not available"]
["OSM_SBR Passenger_FI",{"$f":"'N1 Fitment'!X14","v":0},"standard/optional/not available"]
["OSM_SBR Passenger_FR",{"$f":"'N1 Fitment'!X15","v":0},"standard/optional/not available"]
["OSM_SBR Passenger_DE",{"$f":"'N1 Fitment'!X16","v":0},"standard/optional/not available"]
["OSM_SBR Passenger_GR",{"$f":"'N1 Fitment'!X17","v":0},"standard/optional/not available"]
["OSM_SBR Passenger_HU",{"$f":"'N1 Fitment'!X18","v":0},"standard/optional/not available"]
["OSM_SBR Passenger_IE",{"$f":"'N1 Fitment'!X19","v":0},"standard/optional/not available"]
["OSM_SBR Passenger_IT",{"$f":"'N1 Fitment'!X20","v":0},"standard/optional/not available"]
["OSM_SBR Passenger_LV",{"$f":"'N1 Fitment'!X21","v":0},"standard/optional/not available"]
["OSM_SBR Passenger_LT",{"$f":"'N1 Fitment'!X22","v":0},"standard/optional/not available"]
["OSM_SBR Passenger_LU",{"$f":"'N1 Fitment'!X23","v":0},"standard/optional/not available"]
["OSM_SBR Passenger_MT",{"$f":"'N1 Fitment'!X24","v":0},"standard/optional/not available"]
["OSM_SBR Passenger_NL",{"$f":"'N1 Fitment'!X25","v":0},"standard/optional/not available"]
["OSM_SBR Passenger_PL",{"$f":"'N1 Fitment'!X26","v":0},"standard/optional/not available"]
["OSM_SBR Passenger_PT",{"$f":"'N1 Fitment'!X27","v":0},"standard/optional/not available"]
["OSM_SBR Passenger_RO",{"$f":"'N1 Fitment'!X28","v":0},"standard/optional/not available"]
["OSM_SBR Passenger_SK",{"$f":"'N1 Fitment'!X29","v":0},"standard/optional/not available"]
["OSM_SBR Passenger_SI",{"$f":"'N1 Fitment'!X30","v":0},"standard/optional/not available"]
["OSM_SBR Passenger_ES",{"$f":"'N1 Fitment'!X31","v":0},"standard/optional/not available"]
["OSM_SBR Passenger_SE",{"$f":"'N1 Fitment'!X32","v":0},"standard/optional/not available"]
["OSM_SBR Passenger_GB",{"$f":"'N1 Fitment'!X33","v":0},"standard/optional/not available"]
["OSM_Attention Assist_AT",{"$f":"'N1 Fitment'!T6","v":0},"standard/optional/not available"]
["OSM_Attention Assist_BE",{"$f":"'N1 Fitment'!T7","v":0},"standard/optional/not available"]
["OSM_Attention Assist_BG",{"$f":"'N1 Fitment'!T8","v":0},"standard/optional/not available"]
["OSM_Attention Assist_HR",{"$f":"'N1 Fitment'!T9","v":0},"standard/optional/not available"]
["OSM_Attention Assist_CY",{"$f":"'N1 Fitment'!T10","v":0},"standard/optional/not available"]
["OSM_Attention Assist_CZ",{"$f":"'N1 Fitment'!T11","v":0},"standard/optional/not available"]
["OSM_Attention Assist_DK",{"$f":"'N1 Fitment'!T12","v":0},"standard/optional/not available"]
["OSM_Attention Assist_EE",{"$f":"'N1 Fitment'!T13","v":0},"standard/optional/not available"]
["OSM_Attention Assist_FI",{"$f":"'N1 Fitment'!T14","v":0},"standard/optional/not available"]
["OSM_Attention Assist_FR",{"$f":"'N1 Fitment'!T15","v":0},"standard/optional/not available"]
["OSM_Attention Assist_DE",{"$f":"'N1 Fitment'!T16","v":0},"standard/optional/not available"]
["OSM_Attention Assist_GR",{"$f":"'N1 Fitment'!T17","v":0},"standard/optional/not available"]
["OSM_Attention Assist_HU",{"$f":"'N1 Fitment'!T18","v":0},"standard/optional/not available"]
["OSM_Attention Assist_IE",{"$f":"'N1 Fitment'!T19","v":0},"standard/optional/not available"]
["OSM_Attention Assist_IT",{"$f":"'N1 Fitment'!T20","v":0},"standard/optional/not available"]
["OSM_Attention Assist_LV",{"$f":"'N1 Fitment'!T21","v":0},"standard/optional/not available"]
["OSM_Attention Assist_LT",{"$f":"'N1 Fitment'!T22","v":0},"standard/optional/not available"]
["OSM_Attention Assist_LU",{"$f":"'N1 Fitment'!T23","v":0},"standard/optional/not available"]
["OSM_Attention Assist_MT",{"$f":"'N1 Fitment'!T24","v":0},"standard/optional/not available"]
["OSM_Attention Assist_NL",{"$f":"'N1 Fitment'!T25","v":0},"standard/optional/not available"]
["OSM_Attention Assist_PL",{"$f":"'N1 Fitment'!T26","v":0},"standard/optional/not available"]
["OSM_Attention Assist_PT",{"$f":"'N1 Fitment'!T27","v":0},"standard/optional/not available"]
["OSM_Attention Assist_RO",{"$f":"'N1 Fitment'!T28","v":0},"standard/optional/not available"]
["OSM_Attention Assist_SK",{"$f":"'N1 Fitment'!T29","v":0},"standard/optional/not available"]
["OSM_Attention Assist_SI",{"$f":"'N1 Fitment'!T30","v":0},"standard/optional/not available"]
["OSM_Attention Assist_ES",{"$f":"'N1 Fitment'!T31","v":0},"standard/optional/not available"]
["OSM_Attention Assist_SE",{"$f":"'N1 Fitment'!T32","v":0},"standard/optional/not available"]
["OSM_Attention Assist_GB",{"$f":"'N1 Fitment'!T33","v":0},"standard/optional/not available"]