{"text_format":"1","workbook":"xlsx","n_sheets":22,"sheets":["General Overview","OVERALL RATING","AOP Frontal MPDB","AOP Frontal FW","AOP Side MDB","AOP Side Pole","AOP Farside","AOP Whiplash","AOP Rescue","COP Dynamic","COP Vehicle Based","COP CRS Installation","VRU Headform","VRU Upper Legform","VRU Lower Legform","VRU AEB Pedestrian","VRU AEB Cyclist","SA OSM","SA SAS","SA AEB Car-to-Car","SA LSS","Datasheet"],"not_rendered":{"charts":0,"images":377,"macros":1,"external_links":0,"defined_names":3,"comments":0,"pivot_tables":0},"unopened":[],"bounds":{"document_bytes":16777216,"sheet_cells":100000,"rows_first":2000,"rows_last":500,"rows_between":2000,"halvings":0,"cell_chars":16384,"cell_head_chars":4096},"cells_cut":0,"cells_raw":0,"read":"whole","date_system":"1900"}

{"sheet":"General Overview","index":0,"n_rows":153,"n_cols":24,"rows_kept":153,"cut":false,"hidden":false,"merged":[[49,1,49,3],[50,1,50,3],[39,1,39,3],[40,1,40,3],[41,1,41,3],[42,1,42,3],[43,1,43,3],[63,1,63,3],[64,1,64,3],[58,1,58,3],[59,1,59,3],[60,1,60,3],[61,1,61,3],[62,1,62,3],[51,1,51,3],[52,1,52,3],[53,1,53,3],[54,1,54,3],[55,1,55,3],[13,2,13,4],[14,2,14,4],[18,2,18,4],[48,1,48,6],[36,2,36,3],[23,1,23,3],[24,1,24,3],[25,1,25,3],[26,1,26,3],[15,2,15,3],[33,1,33,3],[34,1,34,3],[35,1,35,3],[38,1,38,3],[27,1,27,3],[28,1,28,3],[29,1,29,3],[30,1,30,3],[31,1,31,3],[44,1,44,3],[45,1,45,3],[46,1,46,3],[32,1,32,3],[11,2,11,4],[12,2,12,4],[3,2,3,4],[4,2,4,4],[5,2,5,4],[6,2,6,4],[7,2,7,4],[9,2,9,4],[8,2,8,4],[10,2,10,4],[71,1,71,2],[71,3,71,4],[69,1,69,4],[70,1,70,4],[66,1,67,2],[66,3,66,6],[67,3,67,4],[68,1,68,2],[68,3,68,4],[84,1,84,2],[84,3,84,4],[83,1,83,2],[83,3,83,4],[82,3,82,4],[72,1,72,2],[72,3,72,4],[73,1,73,2],[73,3,73,4],[74,3,74,4],[75,1,75,2],[75,3,75,4],[76,1,76,2],[76,3,76,4],[96,1,96,2],[96,3,96,4],[92,1,92,2],[92,3,92,4],[93,1,93,2],[93,3,93,4],[94,1,94,2],[94,3,94,4],[88,1,88,2],[88,3,88,4],[90,1,90,2],[90,3,90,4],[91,1,91,2],[91,3,91,4],[1,1,1,4],[95,1,95,2],[95,3,95,4],[16,2,16,3],[17,2,17,3],[85,3,85,4],[86,1,86,2],[86,3,86,4],[87,1,87,2],[87,3,87,4],[89,1,89,2],[89,3,89,4],[81,1,81,2],[81,3,81,4],[82,1,82,2],[77,1,77,2],[77,3,77,4],[78,1,78,2],[78,3,78,4],[79,1,79,2],[79,3,79,4],[80,1,80,2],[80,3,80,4],[85,1,85,2]]}
[]
[3,"VEHICLE SPECIFICATION",null,null,null,"YEAR OF TEST",2021,null,null,null,null,null,null,null,null,null,null,null,null,null,null,null,null,"3 door hatchback"]
[null,null,null,null,null,null,"BASE"]
[null,"Make",null,null,null,"Frontal MPDB test",{"$f":"IF(F3=\"\",\"\",_xlfn.CONCAT(F$3,\"-MP1\"))","v":""},null,null,null,null,null,null,null,null,null,null,null,null,null,null,null,null,"3 door wgon"]
[null,"Model",null,null,null,"Frontal FW test",{"$f":"IF(F3=\"\",\"\",_xlfn.CONCAT(F$3,\"-FW1\"))","v":""},null,null,null,null,null,null,null,null,null,null,null,null,null,null,null,null,"5 door wagon"]
[null,"Start VIN",null,null,null,"Side MDB test",{"$f":"IF(F3=\"\",\"\",_xlfn.CONCAT(F$3,\"-MD1\"))","v":""}]
[null,"Kerb weight (kg)",null,null,null,"Side Pole test",{"$f":"IF(F3=\"\",\"\",_xlfn.CONCAT(F$3,\"-PO1\"))","v":""},null,null,null,null,null,null,null,null,null,null,null,null,null,null,null,null,"5 door SUV"]
[null,"Engine",null,null,null,"Side Occupant-to-Occupant test",{"$f":"IF(F3=\"\",\"\",_xlfn.CONCAT(F$3,\"-O2O\"))","v":""},null,null,null,null,null,null,null,null,null,null,null,null,null,null,null,null,"3 door SUV"]
[null,"Trim level",null,null,null,"Whiplash tests",{"$f":"IF(F3=\"\",\"\",_xlfn.CONCAT(F$3,\"-WHL\"))","v":""},null,null,null,null,null,null,null,null,null,null,null,null,null,null,null,null,"5 door MPV"]
[null,"Safety Pack",null,null,null,"Pedestrian tests",{"$f":"IF(F3=\"\",\"\",_xlfn.CONCAT(F$3,\"-PP\"))","v":""}]
[null,"Body Type",null,null,null,"AEB VRU Pedestrian tests",{"$f":"IF(F3=\"\",\"\",_xlfn.CONCAT(F$3,\"-AEBP\"))","v":""}]
[null,"Full description",null,null,null,"AEB VRU Cyclist tests",{"$f":"IF(F3=\"\",\"\",_xlfn.CONCAT(F$3,\"-AEBB\"))","v":""}]
[null,"Release Date",null,null,null,"OSM test",{"$f":"IF(F3=\"\",\"\",_xlfn.CONCAT(F$3,\"-OSM\"))","v":""}]
[null,"Hand of drive",null,null,null,"SAS tests",{"$f":"IF(F3=\"\",\"\",_xlfn.CONCAT(F$3,\"-SAS\"))","v":""}]
[null,"Seat arrangement",null,null,null,"AEB Car-to-Car tests",{"$f":"IF(F3=\"\",\"\",_xlfn.CONCAT(F$3,\"-AEBC\"))","v":""}]
[null,"front row",null,null,{"$f":"CONCATENATE(C16,C17,C18)","v":""},"LSS tests",{"$f":"IF(F3=\"\",\"\",_xlfn.CONCAT(F$3,\"-LSS\"))","v":""}]
[null,"second row"]
[null,"third row"]
[null,"Vehicle class"]
[]
[null,"SAFETY EQUIPMENT"]
[]
[null,"ADULT OCCUPANT",null,null,"DRIVER","PASSENGER","REAR","ROW 3"]
[null,"FRONTAL"]
[null,"frontal airbag"]
[null,"belt pretensioner"]
[null,"belt loadlimiter"]
[null,"knee airbag"]
[null,"SIDE"]
[null,"side head airbag"]
[null,"side chest airbag"]
[null,"side pelvis airbag"]
[null,"far-side centre airbag"]
[null,"RESCUE"]
[null,"Advanced eCall"]
[null,"MCB"]
[]
[null,"CHILD OCCUPANT",null,null,"DRIVER","PASSENGER","REAR","ROW 3"]
[null,"CHILD RESTRAINT SYSTEM"]
[null,"CRS used for testing"]
[null,"Q6"]
[null,"Q10"]
[null,"VEHICLE BASED"]
[null,"ISOFIX"]
[null,"i-Size"]
[null,"integrated CRS"]
[null,"airbag cut-off switch"]
[]
[null,"VULNERABLE ROAD USER"]
[null,"ACTIVE PEDESTRIAN SYSTEM"]
[null,"deployable bonnet"]
[null,"pedestrian airbag"]
[null,"AEB"]
[null,"AEB Pedestrian"]
[null,"AEB Cyclist"]
[null,"AEB Reverse"]
[]
[null,"SAFETY ASSIST",null,null,"DRIVER","PASSENGER","REAR","ROW 3"]
[null,"SAFETY ASSIST SYSTEMS"]
[null,"SBR",null,null,null,null,null,"Standard"]
[null,"Driver Monitoring"]
[null,"ESC"]
[null,"AEB Car-to-Car"]
[null,"Speed Assist System"]
[null,"Lane Support System"]
[]
[null,"PROTOCOLS"]
[null,null,null,"Protocol",null,"Version","Application"]
[null,"GENERAL"]
[null,"VEHICLE SPECIFICATION, SPONSORSHIP, TESTING AND RETESTING PROTOCOL",null,null,null,"7.1",2018]
[null,"EURO NCAP ASSESSMENT PROTOCOL - OVERALL RATING",null,null,null,"7.0.1",2016]
[null,"ADULT OCCUPANT PROTECTION"]
[null,null,null,"EURO NCAP ASSESSMENT PROTOCOL - AOP",null,"8.0.2",2018]
[null,null,null,"FRONTAL ODB TEST PROTOCOL",null,"7.1.2",2018]
[null,null,null,"FRONTAL FULL WIDTH TEST PROTOCOL",null,"1.0.2",2018]
[null,null,null,"SIDE BARRIER IMPACT TEST PROTOCOL",null,"7.1.1",2018]
[null,null,null,"SIDE POLE IMPACT TEST PROTOCOL",null,"7.0.2",2018]
[null,null,null,"WHIPLASH TESTING PROTOCOL",null,"3.2",2015]
[null,null,null,"REAR WHIPLASH TEST PROTOCOL",null,"1.0",2014]
[null,null,null,"SLED TEST PROCEDURE",null,"2.7",2010]
[null,null,null,"AEB TEST PROCEDURE",null,"2.0.1",2018]
[]
[null,"CHILD OCCUPANT PROTECTION"]
[null,null,null,"EURO NCAP ASSESSMENT PROTOCOL - COP",null,"7.2.1",2018]
[null,null,null,"COP TEST PROTOCOL",null,"7.2.1",2018]
[]
[null,"PEDESTRIAN PROTECTION"]
[null,null,null,"EURO NCAP ASSESSMENT PROTOCOL - PP",null,"9.0.2",2018]
[null,null,null,"PEDESTRIAN TEST PROTOCOL",null,"8.4",2018]
[null,null,null,"AEB VRU TEST PROTOCOL",null,"2.0.2",2018]
[]
[null,"SAFETY ASSIST"]
[null,null,null,"EURO NCAP ASSESSMENT PROTOCOL - SA",null,"8.0.1",2018]
[null,null,null,"SAS TEST PROTOCOL",null,"2.0.1",2018]
[null,null,null,"AEB TEST PROTOCOL",null,"2.0",2018]
[null,null,null,"LSS TEST PROTOCOL",null,"2.0.1",2018]
[]
[]
[]
[]
[]
[]
[]
[]
[]
[null,null,null,null,"Make","Vehicle class","CRS"]
[null,null,null,null,"Alfa Romeo","Supermini"]
[null,null,null,null,"Audi","Small Family Car"]
[null,null,null,null,"BMW","Large Family Car"]
[null,null,null,null,"Chevrolet","Executive"]
[null,null,null,null,"Chrysler","Small MPV"]
[null,null,null,null,"Citroën","Large MPV"]
[null,null,null,null,"Dacia","Small Off-Road 4x4"]
[null,null,null,null,"Daewoo","Large Off-Road 4x4"]
[null,null,null,null,"Daihatsu","Roadster sports"]
[null,null,null,null,"Dodge","Pick-up"]
[null,null,null,null,"FIAT","Business and Family Vans"]
[null,null,null,null,"Ford"]
[null,null,null,null,"Geely Emgrand"]
[null,null,null,null,"Honda"]
[null,null,null,null,"Hyundai"]
[null,null,null,null,"Infiniti"]
[null,null,null,null,"Isuzu"]
[null,null,null,null,"Jaguar"]
[null,null,null,null,"Jeep"]
[null,null,null,null,"Kia"]
[null,null,null,null,"Lancia"]
[null,null,null,null,"Land Rover"]
[null,null,null,null,"Landwind"]
[null,null,null,null,"Lexus"]
[null,null,null,null,"Maserati"]
[null,null,null,null,"Mazda"]
[null,null,null,null,"Mercedes-Benz"]
[null,null,null,null,"MG"]
[null,null,null,null,"MINI"]
[null,null,null,null,"Mitsubishi"]
[null,null,null,null,"Nissan"]
[null,null,null,null,"Opel"]
[null,null,null,null,"Peugeot"]
[null,null,null,null,"Proton"]
[null,null,null,null,"Qoros"]
[null,null,null,null,"Renault"]
[null,null,null,null,"Rover"]
[null,null,null,null,"Saab"]
[null,null,null,null,"Seat"]
[null,null,null,null,"Skoda"]
[null,null,null,null,"smart"]
[null,null,null,null,"Subaru"]
[null,null,null,null,"Suzuki"]
[null,null,null,null,"Tesla"]
[null,null,null,null,"Toyota"]
[null,null,null,null,"Volvo"]
[null,null,null,null,"Volkswagen"]

{"sheet":"OVERALL RATING","index":1,"n_rows":54,"n_cols":12,"rows_kept":54,"cut":false,"hidden":false,"merged":[[40,7,40,10],[32,1,32,6],[52,1,52,10],[53,1,53,10],[54,1,54,10],[43,1,49,5],[43,6,49,10],[40,1,40,2],[42,1,42,10],[32,7,32,10],[39,7,39,8],[39,9,39,10],[34,7,34,8],[34,9,34,10],[35,7,35,8],[35,9,35,10],[55,1,55,10],[50,1,50,5],[50,6,50,10],[56,1,56,10],[57,1,57,10],[25,1,25,10],[15,2,15,3],[16,2,16,3],[16,4,16,5],[16,6,16,7],[20,2,20,3],[19,2,19,3],[21,2,21,3],[22,2,22,3],[23,2,23,3],[19,4,19,5],[20,4,20,5],[21,4,21,5],[22,4,22,5],[23,4,23,5],[26,1,31,2],[40,3,40,4],[26,3,31,4],[40,5,40,6],[26,5,31,6],[39,1,39,2],[39,3,39,4],[39,5,39,6],[34,1,34,2],[34,3,34,4],[34,5,34,6],[35,1,35,2],[35,3,35,4],[35,5,35,6],[4,2,4,3],[4,4,4,5],[13,6,13,7],[14,6,14,7],[14,4,14,5],[4,6,4,7],[5,2,5,3],[14,2,14,3],[13,2,13,3],[5,4,5,5],[5,6,5,7],[5,8,5,9],[16,8,16,9],[13,4,13,5],[15,6,15,7],[15,8,15,9],[13,8,13,9],[14,8,14,9],[15,4,15,5],[1,6,2,6],[1,7,2,9],[26,7,31,8],[26,9,31,10],[15,10,16,10],[4,8,4,9],[19,8,19,9],[20,8,20,9],[21,8,21,9],[22,8,22,9],[23,8,23,9],[19,6,19,7],[20,6,20,7],[21,6,21,7],[22,6,22,7],[23,6,23,7]]}
[]
[null,null,{"$f":"CONCATENATE('General Overview'!C4:E4,\" \",'General Overview'!C5)","v":" "}]
[null,null,{"$f":"CONCATENATE('General Overview'!C8,\" \",'General Overview'!C9,\", \",'General Overview'!C14)","v":" , "}]
[]
[null,null,"ADULT OCCUPANT\n",null,"CHILD OCCUPANT\n",null,"VULNERABLE ROAD USER\n",null,"SAFETY ASSIST\n"]
[null,null,{"$f":"ROUND(C14,1)","v":{"$error":"#NAME?"}},null,{"$f":"ROUND(E14,1)","v":{"$error":"#NAME?"}},null,{"$f":"ROUND(G14,1)","v":0},null,{"$f":"ROUND(I14,1)","v":0}]
[null,null,"Frontal Offset",{"$f":"'AOP Frontal MPDB'!D125","v":{"$error":"#NAME?"}},"Dynamic",{"$f":"IF(OR('General Overview'!C17=\"\",'General Overview'!C18=\"\",'General Overview'!C17>0,'General Overview'!C18>0),'COP Dynamic'!D57,\"\")","v":{"$error":"#NAME?"}},"Headforms",{"$f":"'VRU Headform'!T68","v":0},"OSM",{"$f":"'SA OSM'!D20","v":0}]
[null,null,"Frontal FW",{"$f":"'AOP Frontal FW'!D63","v":{"$error":"#NAME?"}},"Vehicle Based",{"$f":"'COP Vehicle Based'!D37","v":0},"Upper Legform",{"$f":"'VRU Upper Legform'!G35","v":0},"SAS",{"$f":"IF('General Overview'!E64=\"Standard\",'SA SAS'!D49,0)","v":0}]
[null,null,"Side MDB",{"$f":"'AOP Side MDB'!D53","v":{"$error":"#NAME?"}},"CRS Installation",{"$f":"'COP CRS Installation'!H28","v":0},"Lower Legform",{"$f":"'VRU Lower Legform'!E35","v":0},"AEB Car-to-Car",{"$f":"IF('General Overview'!E63=\"Standard\",'SA AEB Car-to-Car'!D112,0)","v":0}]
[null,null,"Side Pole",{"$f":"'AOP Side Pole'!D72","v":{"$error":"#NAME?"}},null,null,"AEB Pedestrian",{"$f":"IF(AND(SUM(H7,H8,H9)>=18,'General Overview'!E54=\"Standard\"),'VRU AEB Pedestrian'!D126,0)","v":0},"LSS",{"$f":"IF('General Overview'!E65=\"Standard\",'SA LSS'!D72,0)","v":0}]
[null,null,"Farside",{"$f":"IF(SUM(D9:D10)<10,0,'AOP Farside'!D69)","v":{"$error":"#NAME?"}},null,null,"AEB Cyclist",{"$f":"IF(AND(SUM(H7,H8,H9)>=18,'General Overview'!E55=\"Standard\"),'VRU AEB Cyclist'!D86,0)","v":0}]
[null,null,"Whiplash",{"$f":"'AOP Whiplash'!D74","v":{"$error":"#NAME?"}}]
[null,null,"Rescue",{"$f":"'AOP Rescue'!D54","v":0}]
[null,"Total Score",{"$f":"SUM(D7:D13)","v":{"$error":"#NAME?"}},null,{"$f":"SUM(F7:F13)","v":{"$error":"#NAME?"}},null,{"$f":"SUM(H7:H13)","v":0},null,{"$f":"SUM(J7:J11)","v":0}]
[null,"Max Points available",38,null,49,null,54,null,16,null,"TOTAL"]
[null,"Normalised Score",{"$f":"INT(C14/C15*100)","v":{"$error":"#NAME?"}},null,{"$f":"INT(E14/E15*100)","v":{"$error":"#NAME?"}},null,{"$f":"INT(G14/G15*100)","v":0},null,{"$f":"INT(I14/I15*100)","v":0},null,{"$f":"INT(ROUND((C14/C15)*100,2)*C17+ROUND((E14/E15)*100,2)*E17+ROUND((G14/G15)*100,2)*G17+ROUND((I14/I15)*100,2)*I17)","v":{"$error":"#NAME?"}}]
[null,"Weight",0.4,null,0.2,null,0.2,null,0.2]
[null,null,null,{"$f":"C16/100","v":{"$error":"#NAME?"}},null,{"$f":"E16/100","v":{"$error":"#NAME?"}},null,{"$f":"G16/100","v":0},null,{"$f":"I16/100","v":0}]
[null,"RATING REQUIREMENTS 2021"]
[null,null,{"$f":"IF($C$16>=80,80,CONCATENATE(\"80 (\",ROUND(80/100*C$15-C$14,3),\"*)\"))","v":{"$error":"#NAME?"}},null,{"$f":"IF($E$16>=80,80,CONCATENATE(\"80 (\",ROUND(80/100*E$15-E$14,3),\"*)\"))","v":{"$error":"#NAME?"}},null,{"$f":"IF($G$16>=60,60,CONCATENATE(\"60 (\",ROUND(60/100*G$15-G$14,3),\"*)\"))","v":"60 (32.4*)"},null,{"$f":"IF($I$16>=70,70,CONCATENATE(\"70 (\",ROUND(70/100*I$15-I$14,3),\"*)\"))","v":"70 (11.2*)"},null,null,{"$f":"IF(AND($C$16>=$C20,$E$16>=$E20,$G$16>=$G20,$I$16>=$I20),1,0)","v":{"$error":"#NAME?"}}]
[null,null,{"$f":"IF($C$16>=70,70,CONCATENATE(\"70 (\",ROUND(70/100*C$15-C$14,3),\"*)\"))","v":{"$error":"#NAME?"}},null,{"$f":"IF($E$16>=70,70,CONCATENATE(\"70 (\",ROUND(70/100*E$15-E$14,3),\"*)\"))","v":{"$error":"#NAME?"}},null,{"$f":"IF($G$16>=50,50,CONCATENATE(\"50 (\",ROUND(50/100*G$15-G$14,3),\"*)\"))","v":"50 (27*)"},null,{"$f":"IF($I$16>=60,60,CONCATENATE(\"60 (\",ROUND(60/100*I$15-I$14,3),\"*)\"))","v":"60 (9.6*)"},null,null,{"$f":"IF(AND($C$16>=$C21,$E$16>=$E21,$G$16>=$G21,$I$16>=$I21),1,0)","v":{"$error":"#NAME?"}}]
[null,null,{"$f":"IF($C$16>=60,60,CONCATENATE(\"60 (\",ROUND(60/100*C$15-C$14,3),\"*)\"))","v":{"$error":"#NAME?"}},null,{"$f":"IF($E$16>=60,60,CONCATENATE(\"60 (\",ROUND(60/100*E$15-E$14,3),\"*)\"))","v":{"$error":"#NAME?"}},null,{"$f":"IF($G$16>=40,40,CONCATENATE(\"40 (\",ROUND(40/100*G$15-G$14,3),\"*)\"))","v":"40 (21.6*)"},null,{"$f":"IF($I$16>=50,50,CONCATENATE(\"50 (\",ROUND(50/100*I$15-I$14,3),\"*)\"))","v":"50 (8*)"},null,null,{"$f":"IF(AND($C$16>=$C22,$E$16>=$E22,$G$16>=$G22,$I$16>=$I22),1,0)","v":{"$error":"#NAME?"}}]
[null,null,{"$f":"IF($C$16>=50,50,CONCATENATE(\"50 (\",ROUND(50/100*C$15-C$14,3),\"*)\"))","v":{"$error":"#NAME?"}},null,{"$f":"IF($E$16>=50,50,CONCATENATE(\"50 (\",ROUND(50/100*E$15-E$14,3),\"*)\"))","v":{"$error":"#NAME?"}},null,{"$f":"IF($G$16>=30,30,CONCATENATE(\"30 (\",ROUND(30/100*G$15-G$14,3),\"*)\"))","v":"30 (16.2*)"},null,{"$f":"IF($I$16>=40,40,CONCATENATE(\"40 (\",ROUND(40/100*I$15-I$14,3),\"*)\"))","v":"40 (6.4*)"},null,null,{"$f":"IF(AND($C$16>=$C23,$E$16>=$E23,$G$16>=$G23,$I$16>=$I23),1,0)","v":{"$error":"#NAME?"}}]
[null,null,{"$f":"IF($C$16>=40,40,CONCATENATE(\"40 (\",ROUND(40/100*C$15-C$14,3),\"*)\"))","v":{"$error":"#NAME?"}},null,{"$f":"IF($E$16>=40,40,CONCATENATE(\"40 (\",ROUND(40/100*E$15-E$14,3),\"*)\"))","v":{"$error":"#NAME?"}},null,{"$f":"IF($G$16>=20,20,CONCATENATE(\"20 (\",ROUND(20/100*G$15-G$14,3),\"*)\"))","v":"20 (10.8*)"},null,{"$f":"IF($I$16>=30,30,CONCATENATE(\"30 (\",ROUND(30/100*I$15-I$14,3),\"*)\"))","v":"30 (4.8*)"},null,null,{"$f":"IF(AND($C$16>=$C24,$E$16>=$E24,$G$16>=$G24,$I$16>=$I24),1,0)","v":{"$error":"#NAME?"}}]
[null,null,"* Points in brackets indicate the number of additional points to be scored to reach that specific star level",null,null,null,null,null,null,null,null,{"$f":"SUM(L20:L24)","v":{"$error":"#NAME?"}}]
[null,"ADULT OCCUPANT"]
[]
[]
[]
[]
[]
[]
[null,"FRONTAL OFFSET IMPACT",null,null,null,null,null,"FRONTAL FW IMPACT"]
[]
[]
[]
[]
[]
[]
[]
[null,"WHIPLASH",null,"SIDE MDB IMPACT",null,"SIDE POLE IMPACT",null,"FAR SIDE IMPACT"]
[]
[null,"CHILD OCCUPANT"]
[]
[]
[]
[]
[]
[]
[]
[null,"FRONTAL IMPACT",null,null,null,null,"SIDE IMPACT"]
[]
[null,"COMMENTS"]
["GENERAL"]

{"sheet":"AOP Frontal MPDB","index":2,"n_rows":1543,"n_cols":14,"rows_kept":1543,"cut":false,"hidden":false,"merged":[[392,1,392,4],[124,1,124,2],[124,3,124,6],[129,1,129,6],[117,3,117,6],[118,4,118,6],[119,4,119,6],[120,4,120,6],[121,3,121,6],[122,1,122,2],[122,3,122,6],[115,1,115,2],[115,3,115,6],[108,1,108,2],[109,3,109,4],[109,5,109,6],[110,3,110,4],[110,5,110,6],[111,3,111,4],[111,5,111,6],[112,3,112,4],[112,5,112,6],[113,1,113,2],[113,3,113,4],[113,5,113,6],[106,5,106,6],[48,1,48,2],[54,1,54,2],[54,3,54,4],[54,5,54,6],[76,1,76,2],[76,3,76,4],[76,5,76,6],[86,1,86,2],[95,1,95,2],[104,1,104,2],[106,1,106,2],[106,3,106,4],[52,5,52,6],[32,1,32,2],[32,3,32,4],[32,5,32,6],[1,1,2,2],[1,3,2,4],[1,5,2,6],[3,1,3,2],[22,1,22,2],[129,8,129,13],[130,8,130,11],[130,12,130,13],[131,8,131,11],[131,12,131,13],[132,8,132,11],[132,12,132,13],[133,8,133,11],[133,12,133,13],[134,8,134,11],[134,12,134,13],[138,8,138,11],[139,8,139,11],[140,8,140,11],[141,12,141,13],[135,8,135,11],[135,12,135,13],[136,8,136,11],[136,12,136,13],[137,8,137,11],[137,12,137,13]]}
[3]
[null,"Frontal MPDB Test",null,"Driver",null,"Passenger"]
[]
[null,{"$f":"'General Overview'!G4","v":""},null,"Value","Points","Value","Points"]
[null,"HEAD"]
[null,null,"Steering wheel airbag present? "]
[null,null,"Peak resultant acceleration - g",null,{"$f":"IF(D6=\"Yes\",IF(D7<80,4,\"\"),IF(D6=\"No\",0,\"\"))","v":""},null,{"$f":"IF(F7=\"\",0,IF(F7<80,4,\"\"))","v":0}]
[null,null,"HIC15",null,{"$f":"IF(D6=\"Yes\",IF(D7<80,\"\",ROUND(Sliding_Scale(D8,500,700,4,0),Round)),0)","v":0},null,{"$f":"IF(F7<80,\"\",ROUND(Sliding_Scale(F8,500,700,4,0),Round))","v":""}]
[null,null,"Resultant Acc. 3 msec exeedence - g",null,{"$f":"IF(D6=\"Yes\",IF(D7<80,\"\",ROUND(Sliding_Scale(D9,72,80,4,0),Round)),IF(D6=\"No\",0,\"\"))","v":""},null,{"$f":"IF(F7<80,\"\",ROUND(Sliding_Scale(F9,72,80,4,0),Round))","v":""}]
[null,null,"For monitoring purpose"]
[null,null,"SUFEHM"]
[null,null,"BrIC"]
[null,null,"UBriC"]
[null,null,"Power"]
[null,null,"KTH"]
[null,null,"Airbag contact modifier (-1)",null,{"$f":"D16","v":0},null,{"$f":"F16","v":0}]
[null,null,"Hazardous airbag deployment modifier (-1)",null,{"$f":"D17","v":0},null,{"$f":"F17","v":0}]
[null,null,"Incorrect airbag deployment modifier (-1)",null,{"$f":"D18","v":0},null,{"$f":"F18","v":0}]
[null,null,"Steering wheel displacement (-1) mm",null,{"$f":"MIN(ROUND(Modifier_Sliding_Scale(D20,90,110,-1,0),Round),ROUND(Modifier_Sliding_Scale(D21,72,88,-1,0),Round),ROUND(Modifier_Sliding_Scale(ABS(D22),90,110,-1,0),Round))","v":{"$error":"#NAME?"}}]
[null,null,"Fore/aft displacement - mm",null,{"$f":"IF(D20>0,\"rearward\",IF(D20<0,\"forward\",\"\"))","v":""}]
[null,null,"Vertical displacement - mm",null,{"$f":"IF(D21>0,\"upward\",IF(D21<0,\"downward\",\"\"))","v":""}]
[null,null,"Lateral displacement - mm",null,{"$f":"IF(D22>0,\"left\",IF(D22<0,\"right\",\"\"))","v":""}]
[null,"Head assessment",null,null,{"$f":"MAX(IF(D6=\"Yes\",MIN(E7:E9)+SUM(E16:E19),IF(D6=\"No\",0)))","v":0},null,{"$f":"MAX(MIN(G7:G9)+SUM(G16:G18),0)","v":0}]
[]
[null,"NECK"]
[null,null,"Shear level exceeded - kN",null,{"$f":"ROUND(Sliding_Scale(D26,1.9,3.1,4,0),Round)","v":{"$error":"#NAME?"}},null,{"$f":"ROUND(Sliding_Scale(F26,IF(F27<25,1.9-0.7*(F27/25),(IF(F27<35,1.2,IF(F27<45,1.2-0.1*(F27-35)/10,1.1)))),IF(F27<25,3.1-1.6*(F27/25),(IF(F27<35,1.5,IF(F27<45,1.5-0.4*(F27-35)/10,1.10000000000001)))),4,0),Round)","v":{"$error":"#NAME?"}}]
[null,null,"duration of exceedence - ms"]
[null,null,"Tension level exceeded - kN",null,{"$f":"ROUND(Sliding_Scale(D28,2.7,3.3,4,0),Round)","v":{"$error":"#NAME?"}},null,{"$f":"ROUND(Sliding_Scale(F28,IF(F29<35,2.7-0.4*(F29/35),(IF(F29<60,2.3-1.2*(F29-35)/25,1.1))),IF(F29<35,3.3-0.4*(F29/35),(IF(F29<60,2.9-1.8*(F29-35)/25,1.10000000000001))),4,0),Round)","v":{"$error":"#NAME?"}}]
[null,null,"duration of exceedence - ms"]
[null,null,"Extension - Nm",null,{"$f":"ROUND(Sliding_Scale(D30,42,57,4,0),Round)","v":{"$error":"#NAME?"}},null,{"$f":"ROUND(Sliding_Scale(F30,42,57,4,0),Round)","v":{"$error":"#NAME?"}}]
[null,"Neck assessment",null,null,{"$f":"MIN(E26,E28,E30)","v":{"$error":"#NAME?"}},null,{"$f":"MIN(G26,G28,G30)","v":{"$error":"#NAME?"}}]
[]
[null,"Head and Neck assessment",null,{"$f":"MIN(E23,E31)","v":{"$error":"#NAME?"}},null,{"$f":"MIN(G23,G31)","v":{"$error":"#NAME?"}}]
[]
[null,"CHEST"]
[null,null,"Compression upper left - mm"]
[null,null,"Compression upper right - mm"]
[null,null,"Compression lower left - mm"]
[null,null,"Compression lower right - mm"]
[null,null,"Chest D / Rmax",{"$f":"MAX(D36:D39)","v":0},{"$f":"IF(D40=0,0,ROUND(Sliding_Scale(D40,35,60,4,0),Round))","v":0}]
[null,null,"Chest D / PCA"]
[null,null,"Compression - mm",null,null,null,{"$f":"ROUND(Sliding_Scale(F42,22,42,4,0),Round)","v":{"$error":"#NAME?"}}]
[null,null,"Viscous criterion - m/s",null,null,null,{"$f":"ROUND(Sliding_Scale(F43,0.5,1,4,0),Round)","v":{"$error":"#NAME?"}}]
[null,null,"Shoulder belt load - kN",null,{"$f":"IF(D44>6,-2,0)","v":0},null,{"$f":"IF(F44>6,-2,0)","v":0}]
[null,null,"Incorrect airbag deployment modifier (-1)",null,{"$f":"D45","v":0},null,{"$f":"F45","v":0}]
[null,null,"Steering wheel contact (-1) ",null,{"$f":"D46","v":0}]
[null,null,"A-Pillar displacement (-2) mm",null,{"$f":"ROUND(Modifier_Sliding_Scale(D47,100,200,-2,0),Round)","v":{"$error":"#NAME?"}}]
[null,null,"Unstable passenger compartment (-1)",null,{"$f":"D48","v":0}]
[null,"Chest assessment",null,null,{"$f":"MAX(E40+SUM(E44:E48),0)","v":{"$error":"#NAME?"}},null,{"$f":"MAX(MIN(G42:G43)+SUM(G44:G45),0)","v":{"$error":"#NAME?"}}]
[null,"ABDOMEN"]
[null,null,"Abdominal Compression left - mm",null,{"$f":"IF(D51=\"\",0,IF(D51>=88,0,4))","v":0}]
[null,null,"Abdominal Compression right - mm",null,{"$f":"IF(D52=\"\",0,IF(D52>=88,0,4))","v":0}]
[null,"Abdomen assessment",null,null,{"$f":"MIN(E51:E52)","v":0}]
[]
[null,"Chest and Abdomen assessment",null,{"$f":"MIN(E49:E52)","v":{"$error":"#NAME?"}},null,{"$f":"G49","v":{"$error":"#NAME?"}}]
[]
[null,"KNEE, FEMUR and PELVIS"]
[null,null,"Left Knee Slide - mm",null,{"$f":"ROUND(Sliding_Scale(D58,6,15,4,0),Round)","v":{"$error":"#NAME?"}},null,{"$f":"ROUND(Sliding_Scale(F58,6,15,4,0),Round)","v":{"$error":"#NAME?"}}]
[null,null,"Left Femur Compression level exceeded - kN",null,{"$f":"ROUND(Sliding_Scale(D59,3.8,IF(D60<11,9.07-1.51*D60/10,7.56),4,0),Round)","v":{"$error":"#NAME?"}},null,{"$f":"ROUND(Sliding_Scale(F59,3.8,IF(F60<11,9.07-1.51*F60/10,7.56),4,0),Round)","v":{"$error":"#NAME?"}}]
[null,null,"duration of exceedence - ms"]
[null,null,"Variable contact (-1) ",null,{"$f":"D61","v":0},null,{"$f":"F61","v":0}]
[null,null,"Concentrated loading (-1) ",null,{"$f":"D62","v":0},null,{"$f":"F62","v":0}]
[null,null,"Incorrect airbag deployment modifier (-1)",null,{"$f":"D63","v":0},null,{"$f":"F63","v":0}]
[null,"Left Knee and Femur assessment",null,null,{"$f":"MAX(MIN(E58:E59)+SUM(E61:E63),0)","v":{"$error":"#NAME?"}},null,{"$f":"MAX(MIN(G58:G59)+SUM(G61:G63),0)","v":{"$error":"#NAME?"}}]
[null,null,"Right Knee Slide - mm",null,{"$f":"ROUND(Sliding_Scale(D65,6,15,4,0),Round)","v":{"$error":"#NAME?"}},null,{"$f":"ROUND(Sliding_Scale(F65,6,15,4,0),Round)","v":{"$error":"#NAME?"}}]
[null,null,"Right Femur Compression level exceeded - kN",null,{"$f":"ROUND(Sliding_Scale(D66,3.8,IF(D67<11,9.07-1.51*D67/10,7.56),4,0),Round)","v":{"$error":"#NAME?"}},null,{"$f":"ROUND(Sliding_Scale(F66,3.8,IF(F67<11,9.07-1.51*F67/10,7.56),4,0),Round)","v":{"$error":"#NAME?"}}]
[null,null,"duration of exceedence - ms"]
[null,null,"Variable contact (-1) ",null,{"$f":"D68","v":0},null,{"$f":"F68","v":0}]
[null,null,"Concentrated loading (-1) ",null,{"$f":"D69","v":0},null,{"$f":"F69","v":0}]
[null,null,"Incorrect airbag deployment modifier (-1)",null,{"$f":"D70","v":0},null,{"$f":"F70","v":0}]
[null,"Right Knee and Femur assessment",null,null,{"$f":"MAX(MIN(E65:E66)+SUM(E68:E70),0)","v":{"$error":"#NAME?"}},null,{"$f":"MAX(MIN(G65:G66)+SUM(G68:G70),0)","v":{"$error":"#NAME?"}}]
[null,null,"Left Acetabulum Compression - kN",null,{"$f":"ROUND(Sliding_Scale(D72,3.28,4.1,4,0),Round)","v":{"$error":"#NAME?"}}]
[null,null,"Right Acetabulum Compression - kN",null,{"$f":"ROUND(Sliding_Scale(D73,3.28,4.1,4,0),Round)","v":{"$error":"#NAME?"}}]
[null,null,"Iliac load drop 1ms - kN",null,{"$f":"IF(D74>=1,-4,0)","v":0}]
[null,"Pelvis assessment",null,null,{"$f":"MAX(0,MIN(E72:E73))","v":{"$error":"#NAME?"}}]
[]
[null,"Knee, Femur and Pelvis assessment",null,{"$f":"MIN(E64,E71,E75)","v":{"$error":"#NAME?"}},null,{"$f":"MIN(G64,G71)","v":{"$error":"#NAME?"}}]
[]
[null,"LOWER LEG"]
[null,null,"Left compression - kN",null,{"$f":"ROUND(Sliding_Scale(D80,2,8,4,0),Round)","v":{"$error":"#NAME?"}},null,{"$f":"ROUND(Sliding_Scale(F80,2,8,4,0),Round)","v":{"$error":"#NAME?"}}]
[null,null,"Left Upper Tibia Index ",null,{"$f":"ROUND(Sliding_Scale(D81,0.4,1.3,4,0),Round)","v":{"$error":"#NAME?"}},null,{"$f":"ROUND(Sliding_Scale(F81,0.4,1.3,4,0),Round)","v":{"$error":"#NAME?"}}]
[null,null,"Left Lower Tibia Index",null,{"$f":"ROUND(Sliding_Scale(D82,0.4,1.3,4,0),Round)","v":{"$error":"#NAME?"}},null,{"$f":"ROUND(Sliding_Scale(F82,0.4,1.3,4,0),Round)","v":{"$error":"#NAME?"}}]
[null,null,"Maximum pedal vertical displacement - mm",{"$f":"MAX(D84:D86)","v":0},{"$f":"ROUND(Modifier_Sliding_Scale(D83,72,88,-1,0),Round)","v":{"$error":"#NAME?"}}]
[null,null,"Brake Vertical displacement - mm",null,{"$f":"IF(D84=\"N/A\",\"\",IF(D84>0,\"upward\",IF(D84<0,\"downward\",\"\")))","v":""},"Brake"]
[null,null,"Clutch Vertical displacement - mm",null,{"$f":"IF(D85=\"N/A\",\"\",IF(D85>0,\"upward\",IF(D85<0,\"downward\",\"\")))","v":""},"Clutch"]
[null,null,"Accel Vertical displacement - mm",null,{"$f":"IF(D86=\"N/A\",\"\",IF(D86>0,\"upward\",IF(D86<0,\"downward\",\"\")))","v":""},"Accelerator"]
[null,"Left Lower Leg assessment",null,null,{"$f":"MAX(MIN(E80:E82)+E83,0)","v":{"$error":"#NAME?"}},null,{"$f":"MIN(G80:G82)","v":{"$error":"#NAME?"}}]
[]
[null,null,"Right compression - kN",null,{"$f":"ROUND(Sliding_Scale(D89,2,8,4,0),Round)","v":{"$error":"#NAME?"}},null,{"$f":"ROUND(Sliding_Scale(F89,2,8,4,0),Round)","v":{"$error":"#NAME?"}}]
[null,null,"Right Upper Tibia Index ",null,{"$f":"ROUND(Sliding_Scale(D90,0.4,1.3,4,0),Round)","v":{"$error":"#NAME?"}},null,{"$f":"ROUND(Sliding_Scale(F90,0.4,1.3,4,0),Round)","v":{"$error":"#NAME?"}}]
[null,null,"Right Lower Tibia Index",null,{"$f":"ROUND(Sliding_Scale(D91,0.4,1.3,4,0),Round)","v":{"$error":"#NAME?"}},null,{"$f":"ROUND(Sliding_Scale(F91,0.4,1.3,4,0),Round)","v":{"$error":"#NAME?"}}]
[null,null,"Maximum pedal vertical displacement - mm",{"$f":"D83","v":0},{"$f":"E83","v":{"$error":"#NAME?"}}]
[null,null,"Brake Vertical displacement - mm",{"$f":"IF(D84=\"\",\"\",D84)","v":""},{"$f":"E84","v":""}]
[null,null,"Clutch Vertical displacement - mm",{"$f":"IF(D85=\"\",\"\",D85)","v":""},{"$f":"E85","v":""}]
[null,null,"Accel Vertical displacement - mm",{"$f":"IF(D86=\"\",\"\",D86)","v":""},{"$f":"E86","v":""}]
[null,"Right Lower Leg assessment",null,null,{"$f":"MAX(MIN(E89:E91)+E92,0)","v":{"$error":"#NAME?"}},null,{"$f":"MIN(G89:G91)","v":{"$error":"#NAME?"}}]
[]
[null,"FOOT and ANKLE"]
[null,null,"Maximum pedal horizontal displacement - mm",{"$f":"MAX(D100:D102)","v":0},{"$f":"IF(COUNTIF(D100:D102,\"\")=3,0,ROUND(Sliding_Scale(D99,100,200,4,0),Round))","v":0}]
[null,null,"Brake Horizontal displacement - mm",null,{"$f":"IF(D100=\"N/A\",\"\",IF(D100>0,\"rearward\",IF(D100<0,\"forward\",\"\")))","v":""},"Brake"]
[null,null,"Clutch Horizontal displacement - mm",null,{"$f":"IF(D101=\"N/A\",\"\",IF(D101>0,\"rearward\",IF(D101<0,\"forward\",\"\")))","v":""},"Clutch"]
[null,null,"Accel Horizontal displacement - mm",null,{"$f":"IF(D102=\"N/A\",\"\",IF(D102>0,\"rearward\",IF(D102<0,\"forward\",\"\")))","v":""},"Accelerator"]
[null,null,"Footwell Rupture (-1)",null,{"$f":"D103","v":0}]
[null,null,"Pedal Blocking (-1)",null,{"$f":"ROUND(Sliding_Scale(D104,50,175,0,-1),Round)","v":{"$error":"#NAME?"}}]
[null,"Foot and Ankle assessment",null,null,{"$f":"MAX(E99+E103+E104,0)","v":{"$error":"#NAME?"}}]
[]
[null,"Lower Leg, Foot and Ankle assessment",null,{"$f":"MIN(E87,E96,E105)","v":{"$error":"#NAME?"}},null,{"$f":"MIN(G87,G96)","v":{"$error":"#NAME?"}}]
[]
[null,"SUMMARY"]
[null,null,"Head and Neck assessment",{"$f":"D33","v":{"$error":"#NAME?"}},null,{"$f":"F33","v":{"$error":"#NAME?"}}]
[null,null,"Chest assessment",{"$f":"D55","v":{"$error":"#NAME?"}},null,{"$f":"F55","v":{"$error":"#NAME?"}}]
[null,null,"Knee, Femur and Pelvis assessment",{"$f":"D77","v":{"$error":"#NAME?"}},null,{"$f":"F77","v":{"$error":"#NAME?"}}]
[null,null,"Lower Leg, Foot and Ankle Assessment",{"$f":"D107","v":{"$error":"#NAME?"}},null,{"$f":"F107","v":{"$error":"#NAME?"}}]
[null,"DUMMY SCORE",null,{"$f":"SUM(D110:E113)","v":{"$error":"#NAME?"}},null,{"$f":"SUM(F110:G113)","v":{"$error":"#NAME?"}}]
[]
[null,"Door Opening",null,0]
[]
[null,"COMPATIBILITY"]
[null,null,"Standard Deviation",{"$f":"IF(COUNTIF(M144:M1543,\"\")>0,\"\",STDEV(N144:N1543))","v":""},{"$f":"IF(COUNTIF(M144:M1543,\"\")>0,\"Enter X-deformation\",((IF((8-2-2)*(25-D120)/(25-40)+2<2,2,IF((8-2-2)*(25-D120)/(25-40)+2>8-2,8-2,(8-2-2)*(25-D120)/(25-40)+2)))*-1)*(IF((1)*(50-D119)/(50-150)<0,0,IF((1)*(50-D119)/(-100)+0>1,1,(1)*(50-D119)/(-100)))))","v":"Enter X-deformation"}]
[null,null,"OLC - g",null,{"$f":"ROUND(Sliding_Scale(D120,25,40,0,-2),Round)","v":{"$error":"#NAME?"}}]
[null,null,"Bottoming out",{"$f":"IF(COUNTIF(N144:N1543,\">630\")>4,\"Yes\",\"No\")","v":"No"},{"$f":"IF(D121=\"Yes\", -2,0)","v":0}]
[]
[null,"Compatibility assessment",null,{"$f":"MAX(-8,SUM(E119:E121))/2","v":{"$error":"#NAME?"}}]
[]
[null,"TOTAL FRONTAL MPDB",null,{"$f":"MAX(IF(OR(E7=0,E8=0,E9=0,G7=0,G8=0,G9=0,E26=0,E30=0,E28=0,G26=0,G28=0,G30=0,E40=G42=0,G43=0,E51=0,E52=0),0,(MIN(D110,F110)+MIN(D111,F111)+MIN(D112,F112)+MIN(D113,F113)+D116+D123)/2),0)","v":{"$error":"#NAME?"}}]
[]
[]
[]
[]
[null,"DUMMY MEASUREMENTS",null,null,null,null,null,null,"BARRIER SCAN"]
[null,"Head",null,null,null,null,null,null,"Vehicle"]
[null,"Ax","Max",null,null,null,null,null,"Width"]
[null,null,"Min",null,null,null,null,null,"Hand of Drive"]
[null,"Ay","Max"]
[null,null,"Min",null,null,null,null,null,"Assessment Zone"]
[null,"Az","Max",null,null,null,null,null,"Width",null,null,null,{"$f":"M132*0.45","v":0}]
[null,null,"Min",null,null,null,null,null,"Nr of colmns",null,null,null,{"$f":"FLOOR(M136/20,1)-10","v":-10}]
[null,"Wx","Max"]
[null,null,"Min",null,null,null,null,null,"Coordinates",null,null,null,{"$f":"IF(M133=\"RHD\",11,50-10-M137+1)","v":51},{"$f":"M139+M137-1","v":40}]
[null,"Wy","Max",null,null,null,null,null,25,null,null,null,{"$f":"CONCATENATE((I140-1)*20+10,\" , \",-(M139-1)*20-10)","v":"490 , -1010"},{"$f":"CONCATENATE((I140-1)*20+10,\" , \",-(N139-1)*20-10)","v":"490 , -790"}]
[null,null,"Min",null,null,null,null,null,6,null,null,null,{"$f":"CONCATENATE((I141-1)*20+10,\" , \",-(M139-1)*20-10)","v":"110 , -1010"},{"$f":"CONCATENATE((I141-1)*20+10,\" , \",-(N139-1)*20-10)","v":"110 , -790"}]
[null,"Wz","Max",null,null,null,null,null,"Y,Z-coordinates",null,null,null,"X-deformation"]
[null,null,"Min",null,null,null,null,null,"Coordinates",null,"Row","Column","All","In Zone"]
[null,"Skull spring",null,null,null,null,null,null,"-10,550",null,{"$f":"1+(RIGHT(I144,LEN(I144)-FIND(\",\",I144))-10)/20","v":28},{"$f":"1+((LEFT(I144,FIND(\",\",I144)-1)*-1)-10)/20","v":1},null,{"$f":"IF(AND(K144<=$I$140,K144>=$I$141,L144>=$M$139,L144<=$N$139),MIN(ROUND(M144,2),633),\"\")","v":""}]
[null,"Fz front","Max",null,null,null,null,null,"-10,530",null,{"$f":"1+(RIGHT(I145,LEN(I145)-FIND(\",\",I145))-10)/20","v":27},{"$f":"1+((LEFT(I145,FIND(\",\",I145)-1)*-1)-10)/20","v":1},null,{"$f":"IF(AND(K145<=$I$140,K145>=$I$141,L145>=$M$139,L145<=$N$139),MIN(ROUND(M145,2),633),\"\")","v":""}]
[null,null,"Min",null,null,null,null,null,"-10,510",null,26,1,null,""]
[null,"Fz rear","Max",null,null,null,null,null,"-10,490",null,25,1,null,""]
[null,null,"Min",null,null,null,null,null,"-10,470",null,24,1,null,""]
[null,"SUFEHM","value",null,null,null,null,null,"-10,450",null,23,1,null,""]
[null,"BrIC","value",null,null,null,null,null,"-10,430",null,22,1,null,""]
[null,"Neck",null,null,null,null,null,null,"-10,410",null,21,1,null,""]
[null,"Fx","Max",null,null,null,null,null,"-10,390",null,20,1,null,""]
[null,null,"Min",null,null,null,null,null,"-10,370",null,19,1,null,""]
[null,"Fy","Max",null,null,null,null,null,"-10,350",null,18,1,null,""]
[null,null,"Min",null,null,null,null,null,"-10,330",null,17,1,null,""]
[null,"Fz","Max",null,null,null,null,null,"-10,310",null,16,1,null,""]
[null,null,"Min",null,null,null,null,null,"-10,290",null,15,1,null,""]
[null,"Mx","Max",null,null,null,null,null,"-10,270",null,14,1,null,""]
[null,null,"Min",null,null,null,null,null,"-10,250",null,13,1,null,""]
[null,"My","Max",null,null,null,null,null,"-10,230",null,12,1,null,""]
[null,null,"Min",null,null,null,null,null,"-10,210",null,11,1,null,""]
[null,"Mz","Max",null,null,null,null,null,"-10,190",null,10,1,null,""]
[null,null,"Min",null,null,null,null,null,"-10,170",null,9,1,null,""]
[null,"Clavicle left inner",null,null,null,null,null,null,"-10,150",null,8,1,null,""]
[null,"Fx","Max",null,null,null,null,null,"-10,130",null,7,1,null,""]
[null,null,"Min",null,null,null,null,null,"-10,110",null,6,1,null,""]
[null,"Fy","Max",null,null,null,null,null,"-10,90",null,5,1,null,""]
[null,null,"Min",null,null,null,null,null,"-10,70",null,4,1,null,""]
[null,"Fz","Max",null,null,null,null,null,"-10,50",null,3,1,null,""]
[null,"Clavicle left outer",null,null,null,null,null,null,"-10,30",null,2,1,null,""]
[null,"Fx","Max",null,null,null,null,null,"-10,10",null,1,1,null,""]
[null,null,"Min",null,null,null,null,null,"-30,550",null,28,2,null,""]
[null,"Fy","Max",null,null,null,null,null,"-30,530",null,27,2,null,""]
[null,null,"Min",null,null,null,null,null,"-30,510",null,26,2,null,""]
[null,"Fz","Max",null,null,null,null,null,"-30,490",null,25,2,null,""]
[null,"Clavicle right inner",null,null,null,null,null,null,"-30,470",null,24,2,null,""]
[null,"Fx","Max",null,null,null,null,null,"-30,450",null,23,2,null,""]
[null,null,"Min",null,null,null,null,null,"-30,430",null,22,2,null,""]
[null,"Fy","Max",null,null,null,null,null,"-30,410",null,21,2,null,""]
[null,null,"Min",null,null,null,null,null,"-30,390",null,20,2,null,""]
[null,"Fz","Max",null,null,null,null,null,"-30,370",null,19,2,null,""]
[null,"Clavicle right outer",null,null,null,null,null,null,"-30,350",null,18,2,null,""]
[null,"Fx","Max",null,null,null,null,null,"-30,330",null,17,2,null,""]
[null,null,"Min",null,null,null,null,null,"-30,310",null,16,2,null,""]
[null,"Fy","Max",null,null,null,null,null,"-30,290",null,15,2,null,""]
[null,null,"Min",null,null,null,null,null,"-30,270",null,14,2,null,""]
[null,"Fz","Max",null,null,null,null,null,"-30,250",null,13,2,null,""]
[null,"Chest left upper",null,null,null,null,null,null,"-30,230",null,12,2,null,""]
[null,"Dx","Max",null,null,null,null,null,"-30,210",null,11,2,null,""]
[null,null,"Min",null,null,null,null,null,"-30,190",null,10,2,null,""]
[null,"Dy","Max",null,null,null,null,null,"-30,170",null,9,2,null,""]
[null,null,"Min",null,null,null,null,null,"-30,150",null,8,2,null,""]
[null,"Dz","Max",null,null,null,null,null,"-30,130",null,7,2,null,""]
[null,null,"Min",null,null,null,null,null,"-30,110",null,6,2,null,""]
[null,"Dchest","Max",null,null,null,null,null,"-30,90",null,5,2,null,""]
[null,null,"Min",null,null,null,null,null,"-30,70",null,4,2,null,""]
[null,"αy","Max",null,null,null,null,null,"-30,50",null,3,2,null,""]
[null,null,"Min",null,null,null,null,null,"-30,30",null,2,2,null,""]
[null,"αz","Max",null,null,null,null,null,"-30,10",null,1,2,null,""]
[null,null,"Min",null,null,null,null,null,"-50,550",null,28,3,null,""]
[null,"Chest right upper",null,null,null,null,null,null,"-50,530",null,27,3,null,""]
[null,"Dx","Max",null,null,null,null,null,"-50,510",null,26,3,null,""]
[null,null,"Min",null,null,null,null,null,"-50,490",null,25,3,null,""]
[null,"Dy","Max",null,null,null,null,null,"-50,470",null,24,3,null,""]
[null,null,"Min",null,null,null,null,null,"-50,450",null,23,3,null,""]
[null,"Dz","Max",null,null,null,null,null,"-50,430",null,22,3,null,""]
[null,null,"Min",null,null,null,null,null,"-50,410",null,21,3,null,""]
[null,"Dchest","Max",null,null,null,null,null,"-50,390",null,20,3,null,""]
[null,null,"Min",null,null,null,null,null,"-50,370",null,{"$f":"1+(RIGHT(I209,LEN(I209)-FIND(\",\",I209))-10)/20","v":19},{"$f":"1+((LEFT(I209,FIND(\",\",I209)-1)*-1)-10)/20","v":3},null,{"$f":"IF(AND(K209<=$I$140,K209>=$I$141,L209>=$M$139,L209<=$N$139),MIN(ROUND(M209,2),633),\"\")","v":""}]
[null,"αy","Max",null,null,null,null,null,"-50,350",null,18,3,null,""]
[null,null,"Min",null,null,null,null,null,"-50,330",null,17,3,null,""]
[null,"αz","Max",null,null,null,null,null,"-50,310",null,16,3,null,""]
[null,null,"Min",null,null,null,null,null,"-50,290",null,15,3,null,""]
[null,"Chest left lower",null,null,null,null,null,null,"-50,270",null,14,3,null,""]
[null,"Dx","Max",null,null,null,null,null,"-50,250",null,13,3,null,""]
[null,null,"Min",null,null,null,null,null,"-50,230",null,12,3,null,""]
[null,"Dy","Max",null,null,null,null,null,"-50,210",null,11,3,null,""]
[null,null,"Min",null,null,null,null,null,"-50,190",null,10,3,null,""]
[null,"Dz","Max",null,null,null,null,null,"-50,170",null,9,3,null,""]
[null,null,"Min",null,null,null,null,null,"-50,150",null,8,3,null,""]
[null,"Dchest","Max",null,null,null,null,null,"-50,130",null,7,3,null,""]
[null,null,"Min",null,null,null,null,null,"-50,110",null,6,3,null,""]
[null,"αy","Max",null,null,null,null,null,"-50,90",null,5,3,null,""]
[null,null,"Min",null,null,null,null,null,"-50,70",null,4,3,null,""]
[null,"αz","Max",null,null,null,null,null,"-50,50",null,3,3,null,""]
[null,null,"Min",null,null,null,null,null,"-50,30",null,2,3,null,""]
[null,"Chest right lower",null,null,null,null,null,null,"-50,10",null,1,3,null,""]
[null,"Dx","Max",null,null,null,null,null,"-70,550",null,28,4,null,""]
[null,null,"Min",null,null,null,null,null,"-70,530",null,27,4,null,""]
[null,"Dy","Max",null,null,null,null,null,"-70,510",null,26,4,null,""]
[null,null,"Min",null,null,null,null,null,"-70,490",null,25,4,null,""]
[null,"Dz","Max",null,null,null,null,null,"-70,470",null,24,4,null,""]
[null,null,"Min",null,null,null,null,null,"-70,450",null,23,4,null,""]
[null,"Dchest","Max",null,null,null,null,null,"-70,430",null,22,4,null,""]
[null,null,"Min",null,null,null,null,null,"-70,410",null,21,4,null,""]
[null,"αy","Max",null,null,null,null,null,"-70,390",null,20,4,null,""]
[null,null,"Min",null,null,null,null,null,"-70,370",null,19,4,null,""]
[null,"αz","Max",null,null,null,null,null,"-70,350",null,18,4,null,""]
[null,null,"Min",null,null,null,null,null,"-70,330",null,17,4,null,""]
[null,"Sternum",null,null,null,null,null,null,"-70,310",null,16,4,null,""]
[null,"Ax","Max",null,null,null,null,null,"-70,290",null,15,4,null,""]
[null,null,"Min",null,null,null,null,null,"-70,270",null,14,4,null,""]
[null,"T1 ",null,null,null,null,null,null,"-70,250",null,13,4,null,""]
[null,"Ax","Max",null,null,null,null,null,"-70,230",null,12,4,null,""]
[null,null,"Min",null,null,null,null,null,"-70,210",null,11,4,null,""]
[null,"Ay","Max",null,null,null,null,null,"-70,190",null,10,4,null,""]
[null,null,"Min",null,null,null,null,null,"-70,170",null,9,4,null,""]
[null,"Az","Max",null,null,null,null,null,"-70,150",null,8,4,null,""]
[null,null,"Min",null,null,null,null,null,"-70,130",null,7,4,null,""]
[null,"resultant","Max",null,null,null,null,null,"-70,110",null,6,4,null,""]
[null,null,"Min",null,null,null,null,null,"-70,90",null,5,4,null,""]
[null,"T4",null,null,null,null,null,null,"-70,70",null,4,4,null,""]
[null,"Ax","Max",null,null,null,null,null,"-70,50",null,3,4,null,""]
[null,null,"Min",null,null,null,null,null,"-70,30",null,2,4,null,""]
[null,"Ay","Max",null,null,null,null,null,"-70,10",null,1,4,null,""]
[null,null,"Min",null,null,null,null,null,"-90,550",null,28,5,null,""]
[null,"Az","Max",null,null,null,null,null,"-90,530",null,27,5,null,""]
[null,null,"Min",null,null,null,null,null,"-90,510",null,26,5,null,""]
[null,"resultant","Max",null,null,null,null,null,"-90,490",null,25,5,null,""]
[null,null,"Min",null,null,null,null,null,"-90,470",null,24,5,null,""]
[null,"T12",null,null,null,null,null,null,"-90,450",null,23,5,null,""]
[null,"Ax","Max",null,null,null,null,null,"-90,430",null,22,5,null,""]
[null,null,"Min",null,null,null,null,null,"-90,410",null,21,5,null,""]
[null,"Ay","Max",null,null,null,null,null,"-90,390",null,20,5,null,""]
[null,null,"Min",null,null,null,null,null,"-90,370",null,19,5,null,""]
[null,"Az","Max",null,null,null,null,null,"-90,350",null,18,5,null,""]
[null,null,"Min",null,null,null,null,null,"-90,330",null,17,5,null,""]
[null,"resultant","Max",null,null,null,null,null,"-90,310",null,16,5,null,""]
[null,null,"Min",null,null,null,null,null,"-90,290",null,15,5,null,""]
[null,"Fx","Max",null,null,null,null,null,"-90,270",null,14,5,null,""]
[null,null,"Min",null,null,null,null,null,"-90,250",null,13,5,null,""]
[null,"Fy","Max",null,null,null,null,null,"-90,230",null,12,5,null,""]
[null,null,"Min",null,null,null,null,null,"-90,210",null,{"$f":"1+(RIGHT(I273,LEN(I273)-FIND(\",\",I273))-10)/20","v":11},{"$f":"1+((LEFT(I273,FIND(\",\",I273)-1)*-1)-10)/20","v":5},null,{"$f":"IF(AND(K273<=$I$140,K273>=$I$141,L273>=$M$139,L273<=$N$139),MIN(ROUND(M273,2),633),\"\")","v":""}]
[null,"Fz","Max",null,null,null,null,null,"-90,190",null,10,5,null,""]
[null,null,"Min",null,null,null,null,null,"-90,170",null,9,5,null,""]
[null,"Mx","Max",null,null,null,null,null,"-90,150",null,8,5,null,""]
[null,null,"Min",null,null,null,null,null,"-90,130",null,7,5,null,""]
[null,"My","Max",null,null,null,null,null,"-90,110",null,6,5,null,""]
[null,null,"Min",null,null,null,null,null,"-90,90",null,5,5,null,""]
[null,"Abdomen",null,null,null,null,null,null,"-90,70",null,4,5,null,""]
[null,"Ax","Max",null,null,null,null,null,"-90,50",null,3,5,null,""]
[null,null,"Min",null,null,null,null,null,"-90,30",null,2,5,null,""]
[null,"Abdomen left",null,null,null,null,null,null,"-90,10",null,1,5,null,""]
[null,"Dx","Max",null,null,null,null,null,"-110,550",null,28,6,null,""]
[null,null,"Min",null,null,null,null,null,"-110,530",null,27,6,null,""]
[null,"Dy","Max",null,null,null,null,null,"-110,510",null,26,6,null,""]
[null,null,"Min",null,null,null,null,null,"-110,490",null,25,6,null,""]
[null,"Dz","Max",null,null,null,null,null,"-110,470",null,24,6,null,""]
[null,null,"Min",null,null,null,null,null,"-110,450",null,23,6,null,""]
[null,"Dabdomen","Max",null,null,null,null,null,"-110,430",null,22,6,null,""]
[null,null,"Min",null,null,null,null,null,"-110,410",null,21,6,null,""]
[null,"αy","Max",null,null,null,null,null,"-110,390",null,20,6,null,""]
[null,null,"Min",null,null,null,null,null,"-110,370",null,19,6,null,""]
[null,"αz","Max",null,null,null,null,null,"-110,350",null,18,6,null,""]
[null,null,"Min",null,null,null,null,null,"-110,330",null,17,6,null,""]
[null,"Abdomen right",null,null,null,null,null,null,"-110,310",null,16,6,null,""]
[null,"Dx","Max",null,null,null,null,null,"-110,290",null,15,6,null,""]
[null,null,"Min",null,null,null,null,null,"-110,270",null,14,6,null,""]
[null,"Dy","Max",null,null,null,null,null,"-110,250",null,13,6,null,""]
[null,null,"Min",null,null,null,null,null,"-110,230",null,12,6,null,""]
[null,"Dz","Max",null,null,null,null,null,"-110,210",null,11,6,null,""]
[null,null,"Min",null,null,null,null,null,"-110,190",null,10,6,null,""]
[null,"Dabdomen","Max",null,null,null,null,null,"-110,170",null,9,6,null,""]
[null,null,"Min",null,null,null,null,null,"-110,150",null,8,6,null,""]
[null,"αy","Max",null,null,null,null,null,"-110,130",null,7,6,null,""]
[null,null,"Min",null,null,null,null,null,"-110,110",null,6,6,null,""]
[null,"αz","Max",null,null,null,null,null,"-110,90",null,5,6,null,""]
[null,null,"Min",null,null,null,null,null,"-110,70",null,4,6,null,""]
[null,"Pelvis",null,null,null,null,null,null,"-110,50",null,3,6,null,""]
[null,"Ax","Max",null,null,null,null,null,"-110,30",null,2,6,null,""]
[null,null,"Min",null,null,null,null,null,"-110,10",null,1,6,null,""]
[null,"Ay","Max",null,null,null,null,null,"-130,550",null,28,7,null,""]
[null,null,"Min",null,null,null,null,null,"-130,530",null,27,7,null,""]
[null,"Az","Max",null,null,null,null,null,"-130,510",null,26,7,null,""]
[null,null,"Min",null,null,null,null,null,"-130,490",null,25,7,null,""]
[null,"Iliac left",null,null,null,null,null,null,"-130,470",null,24,7,null,""]
[null,"Fx","Max",null,null,null,null,null,"-130,450",null,23,7,null,""]
[null,null,"Min",null,null,null,null,null,"-130,430",null,22,7,null,""]
[null,"My","Max",null,null,null,null,null,"-130,410",null,21,7,null,""]
[null,null,"Min",null,null,null,null,null,"-130,390",null,20,7,null,""]
[null,"Iliac right",null,null,null,null,null,null,"-130,370",null,19,7,null,""]
[null,"Fx","Max",null,null,null,null,null,"-130,350",null,18,7,null,""]
[null,null,"Min",null,null,null,null,null,"-130,330",null,17,7,null,""]
[null,"My","Max",null,null,null,null,null,"-130,310",null,16,7,null,""]
[null,null,"Min",null,null,null,null,null,"-130,290",null,15,7,null,""]
[null,"Acetabulum left",null,null,null,null,null,null,"-130,270",null,14,7,null,""]
[null,"Fx","Max",null,null,null,null,null,"-130,250",null,13,7,null,""]
[null,null,"Min",null,null,null,null,null,"-130,230",null,12,7,null,""]
[null,"Fy","Max",null,null,null,null,null,"-130,210",null,11,7,null,""]
[null,null,"Min",null,null,null,null,null,"-130,190",null,10,7,null,""]
[null,"Fz","Max",null,null,null,null,null,"-130,170",null,9,7,null,""]
[null,null,"Min",null,null,null,null,null,"-130,150",null,8,7,null,""]
[null,"Acetabulum right",null,null,null,null,null,null,"-130,130",null,7,7,null,""]
[null,"Fx","Max",null,null,null,null,null,"-130,110",null,6,7,null,""]
[null,null,"Min",null,null,null,null,null,"-130,90",null,5,7,null,""]
[null,"Fy","Max",null,null,null,null,null,"-130,70",null,4,7,null,""]
[null,null,"Min",null,null,null,null,null,"-130,50",null,{"$f":"1+(RIGHT(I337,LEN(I337)-FIND(\",\",I337))-10)/20","v":3},{"$f":"1+((LEFT(I337,FIND(\",\",I337)-1)*-1)-10)/20","v":7},null,{"$f":"IF(AND(K337<=$I$140,K337>=$I$141,L337>=$M$139,L337<=$N$139),MIN(ROUND(M337,2),633),\"\")","v":""}]
[null,"Fz","Max",null,null,null,null,null,"-130,30",null,2,7,null,""]
[null,null,"Min",null,null,null,null,null,"-130,10",null,1,7,null,""]
[null,"Femur (left)",null,null,null,null,null,null,"-150,550",null,28,8,null,""]
[null,"Fz","Max",null,null,null,null,null,"-150,530",null,27,8,null,""]
[null,null,"Min",null,null,null,null,null,"-150,510",null,26,8,null,""]
[null,"Femur (right)",null,null,null,null,null,null,"-150,490",null,25,8,null,""]
[null,"Fz","Max",null,null,null,null,null,"-150,470",null,24,8,null,""]
[null,null,"Min",null,null,null,null,null,"-150,450",null,23,8,null,""]
[null,"Knee (left)",null,null,null,null,null,null,"-150,430",null,22,8,null,""]
[null,"Dknee","Max",null,null,null,null,null,"-150,410",null,21,8,null,""]
[null,null,"Min",null,null,null,null,null,"-150,390",null,20,8,null,""]
[null,"Knee (right)",null,null,null,null,null,null,"-150,370",null,19,8,null,""]
[null,"Dknee","Max",null,null,null,null,null,"-150,350",null,18,8,null,""]
[null,null,"Min",null,null,null,null,null,"-150,330",null,17,8,null,""]
[null,"Upper Tibia (left)",null,null,null,null,null,null,"-150,310",null,16,8,null,""]
[null,"Fx","Max",null,null,null,null,null,"-150,290",null,15,8,null,""]
[null,null,"Min",null,null,null,null,null,"-150,270",null,14,8,null,""]
[null,"Fz","Max",null,null,null,null,null,"-150,250",null,13,8,null,""]
[null,null,"Min",null,null,null,null,null,"-150,230",null,12,8,null,""]
[null,"Mx","Max",null,null,null,null,null,"-150,210",null,11,8,null,""]
[null,null,"Min",null,null,null,null,null,"-150,190",null,10,8,null,""]
[null,"My","Max",null,null,null,null,null,"-150,170",null,9,8,null,""]
[null,null,"Min",null,null,null,null,null,"-150,150",null,8,8,null,""]
[null,"Upper Tibia (right)",null,null,null,null,null,null,"-150,130",null,7,8,null,""]
[null,"Fx","Max",null,null,null,null,null,"-150,110",null,6,8,null,""]
[null,null,"Min",null,null,null,null,null,"-150,90",null,5,8,null,""]
[null,"Fz","Max",null,null,null,null,null,"-150,70",null,4,8,null,""]
[null,null,"Min",null,null,null,null,null,"-150,50",null,3,8,null,""]
[null,"Mx","Max",null,null,null,null,null,"-150,30",null,2,8,null,""]
[null,null,"Min",null,null,null,null,null,"-150,10",null,1,8,null,""]
[null,"My","Max",null,null,null,null,null,"-170,550",null,28,9,null,""]
[null,null,"Min",null,null,null,null,null,"-170,530",null,27,9,null,""]
[null,"Lower Tibia (left)",null,null,null,null,null,null,"-170,510",null,26,9,null,""]
[null,"Fx","Max",null,null,null,null,null,"-170,490",null,25,9,null,""]
[null,null,"Min",null,null,null,null,null,"-170,470",null,24,9,null,""]
[null,"Fy","Max",null,null,null,null,null,"-170,450",null,23,9,null,""]
[null,null,"Min",null,null,null,null,null,"-170,430",null,22,9,null,""]
[null,"Fz","Max",null,null,null,null,null,"-170,410",null,21,9,null,""]
[null,null,"Min",null,null,null,null,null,"-170,390",null,20,9,null,""]
[null,"Mx","Max",null,null,null,null,null,"-170,370",null,19,9,null,""]
[null,null,"Min",null,null,null,null,null,"-170,350",null,18,9,null,""]
[null,"My","Max",null,null,null,null,null,"-170,330",null,17,9,null,""]
[null,null,"Min",null,null,null,null,null,"-170,310",null,16,9,null,""]
[null,"Lower Tibia (right)",null,null,null,null,null,null,"-170,290",null,15,9,null,""]
[null,"Fx","Max",null,null,null,null,null,"-170,270",null,14,9,null,""]
[null,null,"Min",null,null,null,null,null,"-170,250",null,13,9,null,""]
[null,"Fy","Max",null,null,null,null,null,"-170,230",null,12,9,null,""]
[null,null,"Min",null,null,null,null,null,"-170,210",null,11,9,null,""]
[null,"Fz","Max",null,null,null,null,null,"-170,190",null,10,9,null,""]
[null,null,"Min",null,null,null,null,null,"-170,170",null,9,9,null,""]
[null,"Mx","Max",null,null,null,null,null,"-170,150",null,8,9,null,""]
[null,null,"Min",null,null,null,null,null,"-170,130",null,7,9,null,""]
[null,"My","Max",null,null,null,null,null,"-170,110",null,6,9,null,""]
[null,null,"Min",null,null,null,null,null,"-170,90",null,5,9,null,""]
[null,null,null,null,null,null,null,null,"-170,70",null,4,9,null,""]
[null,"TEST DETAILS",null,null,null,null,null,null,"-170,50",null,3,9,null,""]
[null,"Vehicle",null,null,null,null,null,null,"-170,30",null,2,9,null,""]
[null,null,"VIN number",null,null,null,null,null,"-170,10",null,1,9,null,""]
[null,null,"Test weight - kg",null,null,null,null,null,"-190,550",null,28,10,null,""]
[null,"Test",null,null,null,null,null,null,"-190,530",null,27,10,null,""]
[null,null,"Impact speed - km/h",null,null,null,null,null,"-190,510",null,26,10,null,""]
[null,null,"Impact location - mm",null,null,null,null,null,"-190,490",null,25,10,null,""]
[null,null,"Vertical",null,null,null,null,null,"-190,470",null,24,10,null,""]
[null,null,"Horizontal",null,null,null,null,null,"-190,450",null,{"$f":"1+(RIGHT(I401,LEN(I401)-FIND(\",\",I401))-10)/20","v":23},{"$f":"1+((LEFT(I401,FIND(\",\",I401)-1)*-1)-10)/20","v":10},null,{"$f":"IF(AND(K401<=$I$140,K401>=$I$141,L401>=$M$139,L401<=$N$139),MIN(ROUND(M401,2),633),\"\")","v":""}]
[null,null,null,null,null,null,null,null,"-190,430",null,22,10,null,""]
[null,null,null,null,null,null,null,null,"-190,410",null,21,10,null,""]
[null,null,null,null,null,null,null,null,"-190,390",null,20,10,null,""]
[null,null,null,null,null,null,null,null,"-190,370",null,19,10,null,""]
[null,null,null,null,null,null,null,null,"-190,350",null,18,10,null,""]
[null,null,null,null,null,null,null,null,"-190,330",null,17,10,null,""]
[null,null,null,null,null,null,null,null,"-190,310",null,16,10,null,""]
[null,null,null,null,null,null,null,null,"-190,290",null,15,10,null,""]
[null,null,null,null,null,null,null,null,"-190,270",null,14,10,null,""]
[null,null,null,null,null,null,null,null,"-190,250",null,13,10,null,""]
[null,null,null,null,null,null,null,null,"-190,230",null,12,10,null,""]
[null,null,null,null,null,null,null,null,"-190,210",null,11,10,null,""]
[null,null,null,null,null,null,null,null,"-190,190",null,10,10,null,""]
[null,null,null,null,null,null,null,null,"-190,170",null,9,10,null,""]
[null,null,null,null,null,null,null,null,"-190,150",null,8,10,null,""]
[null,null,null,null,null,null,null,null,"-190,130",null,7,10,null,""]
[null,null,null,null,null,null,null,null,"-190,110",null,6,10,null,""]
[null,null,null,null,null,null,null,null,"-190,90",null,5,10,null,""]
[null,null,null,null,null,null,null,null,"-190,70",null,4,10,null,""]
[null,null,null,null,null,null,null,null,"-190,50",null,3,10,null,""]
[null,null,null,null,null,null,null,null,"-190,30",null,2,10,null,""]
[null,null,null,null,null,null,null,null,"-190,10",null,1,10,null,""]
[null,null,null,null,null,null,null,null,"-210,550",null,28,11,null,""]
[null,null,null,null,null,null,null,null,"-210,530",null,27,11,null,""]
[null,null,null,null,null,null,null,null,"-210,510",null,26,11,null,""]
[null,null,null,null,null,null,null,null,"-210,490",null,25,11,null,""]
[null,null,null,null,null,null,null,null,"-210,470",null,24,11,null,""]
[null,null,null,null,null,null,null,null,"-210,450",null,23,11,null,""]
[null,null,null,null,null,null,null,null,"-210,430",null,22,11,null,""]
[null,null,null,null,null,null,null,null,"-210,410",null,21,11,null,""]
[null,null,null,null,null,null,null,null,"-210,390",null,20,11,null,""]
[null,null,null,null,null,null,null,null,"-210,370",null,19,11,null,""]
[null,null,null,null,null,null,null,null,"-210,350",null,18,11,null,""]
[null,null,null,null,null,null,null,null,"-210,330",null,17,11,null,""]
[null,null,null,null,null,null,null,null,"-210,310",null,16,11,null,""]
[null,null,null,null,null,null,null,null,"-210,290",null,15,11,null,""]
[null,null,null,null,null,null,null,null,"-210,270",null,14,11,null,""]
[null,null,null,null,null,null,null,null,"-210,250",null,13,11,null,""]
[null,null,null,null,null,null,null,null,"-210,230",null,12,11,null,""]
[null,null,null,null,null,null,null,null,"-210,210",null,11,11,null,""]
[null,null,null,null,null,null,null,null,"-210,190",null,10,11,null,""]
[null,null,null,null,null,null,null,null,"-210,170",null,9,11,null,""]
[null,null,null,null,null,null,null,null,"-210,150",null,8,11,null,""]
[null,null,null,null,null,null,null,null,"-210,130",null,7,11,null,""]
[null,null,null,null,null,null,null,null,"-210,110",null,6,11,null,""]
[null,null,null,null,null,null,null,null,"-210,90",null,5,11,null,""]
[null,null,null,null,null,null,null,null,"-210,70",null,4,11,null,""]
[null,null,null,null,null,null,null,null,"-210,50",null,3,11,null,""]
[null,null,null,null,null,null,null,null,"-210,30",null,2,11,null,""]
[null,null,null,null,null,null,null,null,"-210,10",null,1,11,null,""]
[null,null,null,null,null,null,null,null,"-230,550",null,28,12,null,""]
[null,null,null,null,null,null,null,null,"-230,530",null,27,12,null,""]
[null,null,null,null,null,null,null,null,"-230,510",null,26,12,null,""]
[null,null,null,null,null,null,null,null,"-230,490",null,25,12,null,""]
[null,null,null,null,null,null,null,null,"-230,470",null,24,12,null,""]
[null,null,null,null,null,null,null,null,"-230,450",null,23,12,null,""]
[null,null,null,null,null,null,null,null,"-230,430",null,22,12,null,""]
[null,null,null,null,null,null,null,null,"-230,410",null,21,12,null,""]
[null,null,null,null,null,null,null,null,"-230,390",null,20,12,null,""]
[null,null,null,null,null,null,null,null,"-230,370",null,19,12,null,""]
[null,null,null,null,null,null,null,null,"-230,350",null,18,12,null,""]
[null,null,null,null,null,null,null,null,"-230,330",null,17,12,null,""]
[null,null,null,null,null,null,null,null,"-230,310",null,16,12,null,""]
[null,null,null,null,null,null,null,null,"-230,290",null,{"$f":"1+(RIGHT(I465,LEN(I465)-FIND(\",\",I465))-10)/20","v":15},{"$f":"1+((LEFT(I465,FIND(\",\",I465)-1)*-1)-10)/20","v":12},null,{"$f":"IF(AND(K465<=$I$140,K465>=$I$141,L465>=$M$139,L465<=$N$139),MIN(ROUND(M465,2),633),\"\")","v":""}]
[null,null,null,null,null,null,null,null,"-230,270",null,14,12,null,""]
[null,null,null,null,null,null,null,null,"-230,250",null,13,12,null,""]
[null,null,null,null,null,null,null,null,"-230,230",null,12,12,null,""]
[null,null,null,null,null,null,null,null,"-230,210",null,11,12,null,""]
[null,null,null,null,null,null,null,null,"-230,190",null,10,12,null,""]
[null,null,null,null,null,null,null,null,"-230,170",null,9,12,null,""]
[null,null,null,null,null,null,null,null,"-230,150",null,8,12,null,""]
[null,null,null,null,null,null,null,null,"-230,130",null,7,12,null,""]
[null,null,null,null,null,null,null,null,"-230,110",null,6,12,null,""]
[null,null,null,null,null,null,null,null,"-230,90",null,5,12,null,""]
[null,null,null,null,null,null,null,null,"-230,70",null,4,12,null,""]
[null,null,null,null,null,null,null,null,"-230,50",null,3,12,null,""]
[null,null,null,null,null,null,null,null,"-230,30",null,2,12,null,""]
[null,null,null,null,null,null,null,null,"-230,10",null,1,12,null,""]
[null,null,null,null,null,null,null,null,"-250,550",null,28,13,null,""]
[null,null,null,null,null,null,null,null,"-250,530",null,27,13,null,""]
[null,null,null,null,null,null,null,null,"-250,510",null,26,13,null,""]
[null,null,null,null,null,null,null,null,"-250,490",null,25,13,null,""]
[null,null,null,null,null,null,null,null,"-250,470",null,24,13,null,""]
[null,null,null,null,null,null,null,null,"-250,450",null,23,13,null,""]
[null,null,null,null,null,null,null,null,"-250,430",null,22,13,null,""]
[null,null,null,null,null,null,null,null,"-250,410",null,21,13,null,""]
[null,null,null,null,null,null,null,null,"-250,390",null,20,13,null,""]
[null,null,null,null,null,null,null,null,"-250,370",null,19,13,null,""]
[null,null,null,null,null,null,null,null,"-250,350",null,18,13,null,""]
[null,null,null,null,null,null,null,null,"-250,330",null,17,13,null,""]
[null,null,null,null,null,null,null,null,"-250,310",null,16,13,null,""]
[null,null,null,null,null,null,null,null,"-250,290",null,15,13,null,""]
[null,null,null,null,null,null,null,null,"-250,270",null,14,13,null,""]
[null,null,null,null,null,null,null,null,"-250,250",null,13,13,null,""]
[null,null,null,null,null,null,null,null,"-250,230",null,12,13,null,""]
[null,null,null,null,null,null,null,null,"-250,210",null,11,13,null,""]
[null,null,null,null,null,null,null,null,"-250,190",null,10,13,null,""]
[null,null,null,null,null,null,null,null,"-250,170",null,9,13,null,""]
[null,null,null,null,null,null,null,null,"-250,150",null,8,13,null,""]
[null,null,null,null,null,null,null,null,"-250,130",null,7,13,null,""]
[null,null,null,null,null,null,null,null,"-250,110",null,6,13,null,""]
[null,null,null,null,null,null,null,null,"-250,90",null,5,13,null,""]
[null,null,null,null,null,null,null,null,"-250,70",null,4,13,null,""]
[null,null,null,null,null,null,null,null,"-250,50",null,3,13,null,""]
[null,null,null,null,null,null,null,null,"-250,30",null,2,13,null,""]
[null,null,null,null,null,null,null,null,"-250,10",null,1,13,null,""]
[null,null,null,null,null,null,null,null,"-270,550",null,28,14,null,""]
[null,null,null,null,null,null,null,null,"-270,530",null,27,14,null,""]
[null,null,null,null,null,null,null,null,"-270,510",null,26,14,null,""]
[null,null,null,null,null,null,null,null,"-270,490",null,25,14,null,""]
[null,null,null,null,null,null,null,null,"-270,470",null,24,14,null,""]
[null,null,null,null,null,null,null,null,"-270,450",null,23,14,null,""]
[null,null,null,null,null,null,null,null,"-270,430",null,22,14,null,""]
[null,null,null,null,null,null,null,null,"-270,410",null,21,14,null,""]
[null,null,null,null,null,null,null,null,"-270,390",null,20,14,null,""]
[null,null,null,null,null,null,null,null,"-270,370",null,19,14,null,""]
[null,null,null,null,null,null,null,null,"-270,350",null,18,14,null,""]
[null,null,null,null,null,null,null,null,"-270,330",null,17,14,null,""]
[null,null,null,null,null,null,null,null,"-270,310",null,16,14,null,""]
[null,null,null,null,null,null,null,null,"-270,290",null,15,14,null,""]
[null,null,null,null,null,null,null,null,"-270,270",null,14,14,null,""]
[null,null,null,null,null,null,null,null,"-270,250",null,13,14,null,""]
[null,null,null,null,null,null,null,null,"-270,230",null,12,14,null,""]
[null,null,null,null,null,null,null,null,"-270,210",null,11,14,null,""]
[null,null,null,null,null,null,null,null,"-270,190",null,10,14,null,""]
[null,null,null,null,null,null,null,null,"-270,170",null,9,14,null,""]
[null,null,null,null,null,null,null,null,"-270,150",null,8,14,null,""]
[null,null,null,null,null,null,null,null,"-270,130",null,{"$f":"1+(RIGHT(I529,LEN(I529)-FIND(\",\",I529))-10)/20","v":7},{"$f":"1+((LEFT(I529,FIND(\",\",I529)-1)*-1)-10)/20","v":14},null,{"$f":"IF(AND(K529<=$I$140,K529>=$I$141,L529>=$M$139,L529<=$N$139),MIN(ROUND(M529,2),633),\"\")","v":""}]
[null,null,null,null,null,null,null,null,"-270,110",null,6,14,null,""]
[null,null,null,null,null,null,null,null,"-270,90",null,5,14,null,""]
[null,null,null,null,null,null,null,null,"-270,70",null,4,14,null,""]
[null,null,null,null,null,null,null,null,"-270,50",null,3,14,null,""]
[null,null,null,null,null,null,null,null,"-270,30",null,2,14,null,""]
[null,null,null,null,null,null,null,null,"-270,10",null,1,14,null,""]
[null,null,null,null,null,null,null,null,"-290,550",null,28,15,null,""]
[null,null,null,null,null,null,null,null,"-290,530",null,27,15,null,""]
[null,null,null,null,null,null,null,null,"-290,510",null,26,15,null,""]
[null,null,null,null,null,null,null,null,"-290,490",null,25,15,null,""]
[null,null,null,null,null,null,null,null,"-290,470",null,24,15,null,""]
[null,null,null,null,null,null,null,null,"-290,450",null,23,15,null,""]
[null,null,null,null,null,null,null,null,"-290,430",null,22,15,null,""]
[null,null,null,null,null,null,null,null,"-290,410",null,21,15,null,""]
[null,null,null,null,null,null,null,null,"-290,390",null,20,15,null,""]
[null,null,null,null,null,null,null,null,"-290,370",null,19,15,null,""]
[null,null,null,null,null,null,null,null,"-290,350",null,18,15,null,""]
[null,null,null,null,null,null,null,null,"-290,330",null,17,15,null,""]
[null,null,null,null,null,null,null,null,"-290,310",null,16,15,null,""]
[null,null,null,null,null,null,null,null,"-290,290",null,15,15,null,""]
[null,null,null,null,null,null,null,null,"-290,270",null,14,15,null,""]
[null,null,null,null,null,null,null,null,"-290,250",null,13,15,null,""]
[null,null,null,null,null,null,null,null,"-290,230",null,12,15,null,""]
[null,null,null,null,null,null,null,null,"-290,210",null,11,15,null,""]
[null,null,null,null,null,null,null,null,"-290,190",null,10,15,null,""]
[null,null,null,null,null,null,null,null,"-290,170",null,9,15,null,""]
[null,null,null,null,null,null,null,null,"-290,150",null,8,15,null,""]
[null,null,null,null,null,null,null,null,"-290,130",null,7,15,null,""]
[null,null,null,null,null,null,null,null,"-290,110",null,6,15,null,""]
[null,null,null,null,null,null,null,null,"-290,90",null,5,15,null,""]
[null,null,null,null,null,null,null,null,"-290,70",null,4,15,null,""]
[null,null,null,null,null,null,null,null,"-290,50",null,3,15,null,""]
[null,null,null,null,null,null,null,null,"-290,30",null,2,15,null,""]
[null,null,null,null,null,null,null,null,"-290,10",null,1,15,null,""]
[null,null,null,null,null,null,null,null,"-310,550",null,28,16,null,""]
[null,null,null,null,null,null,null,null,"-310,530",null,27,16,null,""]
[null,null,null,null,null,null,null,null,"-310,510",null,26,16,null,""]
[null,null,null,null,null,null,null,null,"-310,490",null,25,16,null,""]
[null,null,null,null,null,null,null,null,"-310,470",null,24,16,null,""]
[null,null,null,null,null,null,null,null,"-310,450",null,23,16,null,""]
[null,null,null,null,null,null,null,null,"-310,430",null,22,16,null,""]
[null,null,null,null,null,null,null,null,"-310,410",null,21,16,null,""]
[null,null,null,null,null,null,null,null,"-310,390",null,20,16,null,""]
[null,null,null,null,null,null,null,null,"-310,370",null,19,16,null,""]
[null,null,null,null,null,null,null,null,"-310,350",null,18,16,null,""]
[null,null,null,null,null,null,null,null,"-310,330",null,17,16,null,""]
[null,null,null,null,null,null,null,null,"-310,310",null,16,16,null,""]
[null,null,null,null,null,null,null,null,"-310,290",null,15,16,null,""]
[null,null,null,null,null,null,null,null,"-310,270",null,14,16,null,""]
[null,null,null,null,null,null,null,null,"-310,250",null,13,16,null,""]
[null,null,null,null,null,null,null,null,"-310,230",null,12,16,null,""]
[null,null,null,null,null,null,null,null,"-310,210",null,11,16,null,""]
[null,null,null,null,null,null,null,null,"-310,190",null,10,16,null,""]
[null,null,null,null,null,null,null,null,"-310,170",null,9,16,null,""]
[null,null,null,null,null,null,null,null,"-310,150",null,8,16,null,""]
[null,null,null,null,null,null,null,null,"-310,130",null,7,16,null,""]
[null,null,null,null,null,null,null,null,"-310,110",null,6,16,null,""]
[null,null,null,null,null,null,null,null,"-310,90",null,5,16,null,""]
[null,null,null,null,null,null,null,null,"-310,70",null,4,16,null,""]
[null,null,null,null,null,null,null,null,"-310,50",null,3,16,null,""]
[null,null,null,null,null,null,null,null,"-310,30",null,2,16,null,""]
[null,null,null,null,null,null,null,null,"-310,10",null,1,16,null,""]
[null,null,null,null,null,null,null,null,"-330,550",null,28,17,null,""]
[null,null,null,null,null,null,null,null,"-330,530",null,{"$f":"1+(RIGHT(I593,LEN(I593)-FIND(\",\",I593))-10)/20","v":27},{"$f":"1+((LEFT(I593,FIND(\",\",I593)-1)*-1)-10)/20","v":17},null,{"$f":"IF(AND(K593<=$I$140,K593>=$I$141,L593>=$M$139,L593<=$N$139),MIN(ROUND(M593,2),633),\"\")","v":""}]
[null,null,null,null,null,null,null,null,"-330,510",null,26,17,null,""]
[null,null,null,null,null,null,null,null,"-330,490",null,25,17,null,""]
[null,null,null,null,null,null,null,null,"-330,470",null,24,17,null,""]
[null,null,null,null,null,null,null,null,"-330,450",null,23,17,null,""]
[null,null,null,null,null,null,null,null,"-330,430",null,22,17,null,""]
[null,null,null,null,null,null,null,null,"-330,410",null,21,17,null,""]
[null,null,null,null,null,null,null,null,"-330,390",null,20,17,null,""]
[null,null,null,null,null,null,null,null,"-330,370",null,19,17,null,""]
[null,null,null,null,null,null,null,null,"-330,350",null,18,17,null,""]
[null,null,null,null,null,null,null,null,"-330,330",null,17,17,null,""]
[null,null,null,null,null,null,null,null,"-330,310",null,16,17,null,""]
[null,null,null,null,null,null,null,null,"-330,290",null,15,17,null,""]
[null,null,null,null,null,null,null,null,"-330,270",null,14,17,null,""]
[null,null,null,null,null,null,null,null,"-330,250",null,13,17,null,""]
[null,null,null,null,null,null,null,null,"-330,230",null,12,17,null,""]
[null,null,null,null,null,null,null,null,"-330,210",null,11,17,null,""]
[null,null,null,null,null,null,null,null,"-330,190",null,10,17,null,""]
[null,null,null,null,null,null,null,null,"-330,170",null,9,17,null,""]
[null,null,null,null,null,null,null,null,"-330,150",null,8,17,null,""]
[null,null,null,null,null,null,null,null,"-330,130",null,7,17,null,""]
[null,null,null,null,null,null,null,null,"-330,110",null,6,17,null,""]
[null,null,null,null,null,null,null,null,"-330,90",null,5,17,null,""]
[null,null,null,null,null,null,null,null,"-330,70",null,4,17,null,""]
[null,null,null,null,null,null,null,null,"-330,50",null,3,17,null,""]
[null,null,null,null,null,null,null,null,"-330,30",null,2,17,null,""]
[null,null,null,null,null,null,null,null,"-330,10",null,1,17,null,""]
[null,null,null,null,null,null,null,null,"-350,550",null,28,18,null,""]
[null,null,null,null,null,null,null,null,"-350,530",null,27,18,null,""]
[null,null,null,null,null,null,null,null,"-350,510",null,26,18,null,""]
[null,null,null,null,null,null,null,null,"-350,490",null,25,18,null,""]
[null,null,null,null,null,null,null,null,"-350,470",null,24,18,null,""]
[null,null,null,null,null,null,null,null,"-350,450",null,23,18,null,""]
[null,null,null,null,null,null,null,null,"-350,430",null,22,18,null,""]
[null,null,null,null,null,null,null,null,"-350,410",null,21,18,null,""]
[null,null,null,null,null,null,null,null,"-350,390",null,20,18,null,""]
[null,null,null,null,null,null,null,null,"-350,370",null,19,18,null,""]
[null,null,null,null,null,null,null,null,"-350,350",null,18,18,null,""]
[null,null,null,null,null,null,null,null,"-350,330",null,17,18,null,""]
[null,null,null,null,null,null,null,null,"-350,310",null,16,18,null,""]
[null,null,null,null,null,null,null,null,"-350,290",null,15,18,null,""]
[null,null,null,null,null,null,null,null,"-350,270",null,14,18,null,""]
[null,null,null,null,null,null,null,null,"-350,250",null,13,18,null,""]
[null,null,null,null,null,null,null,null,"-350,230",null,12,18,null,""]
[null,null,null,null,null,null,null,null,"-350,210",null,11,18,null,""]
[null,null,null,null,null,null,null,null,"-350,190",null,10,18,null,""]
[null,null,null,null,null,null,null,null,"-350,170",null,9,18,null,""]
[null,null,null,null,null,null,null,null,"-350,150",null,8,18,null,""]
[null,null,null,null,null,null,null,null,"-350,130",null,7,18,null,""]
[null,null,null,null,null,null,null,null,"-350,110",null,6,18,null,""]
[null,null,null,null,null,null,null,null,"-350,90",null,5,18,null,""]
[null,null,null,null,null,null,null,null,"-350,70",null,4,18,null,""]
[null,null,null,null,null,null,null,null,"-350,50",null,3,18,null,""]
[null,null,null,null,null,null,null,null,"-350,30",null,2,18,null,""]
[null,null,null,null,null,null,null,null,"-350,10",null,1,18,null,""]
[null,null,null,null,null,null,null,null,"-370,550",null,28,19,null,""]
[null,null,null,null,null,null,null,null,"-370,530",null,27,19,null,""]
[null,null,null,null,null,null,null,null,"-370,510",null,26,19,null,""]
[null,null,null,null,null,null,null,null,"-370,490",null,25,19,null,""]
[null,null,null,null,null,null,null,null,"-370,470",null,24,19,null,""]
[null,null,null,null,null,null,null,null,"-370,450",null,23,19,null,""]
[null,null,null,null,null,null,null,null,"-370,430",null,22,19,null,""]
[null,null,null,null,null,null,null,null,"-370,410",null,21,19,null,""]
[null,null,null,null,null,null,null,null,"-370,390",null,20,19,null,""]
[null,null,null,null,null,null,null,null,"-370,370",null,{"$f":"1+(RIGHT(I657,LEN(I657)-FIND(\",\",I657))-10)/20","v":19},{"$f":"1+((LEFT(I657,FIND(\",\",I657)-1)*-1)-10)/20","v":19},null,{"$f":"IF(AND(K657<=$I$140,K657>=$I$141,L657>=$M$139,L657<=$N$139),MIN(ROUND(M657,2),633),\"\")","v":""}]
[null,null,null,null,null,null,null,null,"-370,350",null,18,19,null,""]
[null,null,null,null,null,null,null,null,"-370,330",null,17,19,null,""]
[null,null,null,null,null,null,null,null,"-370,310",null,16,19,null,""]
[null,null,null,null,null,null,null,null,"-370,290",null,15,19,null,""]
[null,null,null,null,null,null,null,null,"-370,270",null,14,19,null,""]
[null,null,null,null,null,null,null,null,"-370,250",null,13,19,null,""]
[null,null,null,null,null,null,null,null,"-370,230",null,12,19,null,""]
[null,null,null,null,null,null,null,null,"-370,210",null,11,19,null,""]
[null,null,null,null,null,null,null,null,"-370,190",null,10,19,null,""]
[null,null,null,null,null,null,null,null,"-370,170",null,9,19,null,""]
[null,null,null,null,null,null,null,null,"-370,150",null,8,19,null,""]
[null,null,null,null,null,null,null,null,"-370,130",null,7,19,null,""]
[null,null,null,null,null,null,null,null,"-370,110",null,6,19,null,""]
[null,null,null,null,null,null,null,null,"-370,90",null,5,19,null,""]
[null,null,null,null,null,null,null,null,"-370,70",null,4,19,null,""]
[null,null,null,null,null,null,null,null,"-370,50",null,3,19,null,""]
[null,null,null,null,null,null,null,null,"-370,30",null,2,19,null,""]
[null,null,null,null,null,null,null,null,"-370,10",null,1,19,null,""]
[null,null,null,null,null,null,null,null,"-390,550",null,28,20,null,""]
[null,null,null,null,null,null,null,null,"-390,530",null,27,20,null,""]
[null,null,null,null,null,null,null,null,"-390,510",null,26,20,null,""]
[null,null,null,null,null,null,null,null,"-390,490",null,25,20,null,""]
[null,null,null,null,null,null,null,null,"-390,470",null,24,20,null,""]
[null,null,null,null,null,null,null,null,"-390,450",null,23,20,null,""]
[null,null,null,null,null,null,null,null,"-390,430",null,22,20,null,""]
[null,null,null,null,null,null,null,null,"-390,410",null,21,20,null,""]
[null,null,null,null,null,null,null,null,"-390,390",null,20,20,null,""]
[null,null,null,null,null,null,null,null,"-390,370",null,19,20,null,""]
[null,null,null,null,null,null,null,null,"-390,350",null,18,20,null,""]
[null,null,null,null,null,null,null,null,"-390,330",null,17,20,null,""]
[null,null,null,null,null,null,null,null,"-390,310",null,16,20,null,""]
[null,null,null,null,null,null,null,null,"-390,290",null,15,20,null,""]
[null,null,null,null,null,null,null,null,"-390,270",null,14,20,null,""]
[null,null,null,null,null,null,null,null,"-390,250",null,13,20,null,""]
[null,null,null,null,null,null,null,null,"-390,230",null,12,20,null,""]
[null,null,null,null,null,null,null,null,"-390,210",null,11,20,null,""]
[null,null,null,null,null,null,null,null,"-390,190",null,10,20,null,""]
[null,null,null,null,null,null,null,null,"-390,170",null,9,20,null,""]
[null,null,null,null,null,null,null,null,"-390,150",null,8,20,null,""]
[null,null,null,null,null,null,null,null,"-390,130",null,7,20,null,""]
[null,null,null,null,null,null,null,null,"-390,110",null,6,20,null,""]
[null,null,null,null,null,null,null,null,"-390,90",null,5,20,null,""]
[null,null,null,null,null,null,null,null,"-390,70",null,4,20,null,""]
[null,null,null,null,null,null,null,null,"-390,50",null,3,20,null,""]
[null,null,null,null,null,null,null,null,"-390,30",null,2,20,null,""]
[null,null,null,null,null,null,null,null,"-390,10",null,1,20,null,""]
[null,null,null,null,null,null,null,null,"-410,550",null,28,21,null,""]
[null,null,null,null,null,null,null,null,"-410,530",null,27,21,null,""]
[null,null,null,null,null,null,null,null,"-410,510",null,26,21,null,""]
[null,null,null,null,null,null,null,null,"-410,490",null,25,21,null,""]
[null,null,null,null,null,null,null,null,"-410,470",null,24,21,null,""]
[null,null,null,null,null,null,null,null,"-410,450",null,23,21,null,""]
[null,null,null,null,null,null,null,null,"-410,430",null,22,21,null,""]
[null,null,null,null,null,null,null,null,"-410,410",null,21,21,null,""]
[null,null,null,null,null,null,null,null,"-410,390",null,20,21,null,""]
[null,null,null,null,null,null,null,null,"-410,370",null,19,21,null,""]
[null,null,null,null,null,null,null,null,"-410,350",null,18,21,null,""]
[null,null,null,null,null,null,null,null,"-410,330",null,17,21,null,""]
[null,null,null,null,null,null,null,null,"-410,310",null,16,21,null,""]
[null,null,null,null,null,null,null,null,"-410,290",null,15,21,null,""]
[null,null,null,null,null,null,null,null,"-410,270",null,14,21,null,""]
[null,null,null,null,null,null,null,null,"-410,250",null,13,21,null,""]
[null,null,null,null,null,null,null,null,"-410,230",null,12,21,null,""]
[null,null,null,null,null,null,null,null,"-410,210",null,{"$f":"1+(RIGHT(I721,LEN(I721)-FIND(\",\",I721))-10)/20","v":11},{"$f":"1+((LEFT(I721,FIND(\",\",I721)-1)*-1)-10)/20","v":21},null,{"$f":"IF(AND(K721<=$I$140,K721>=$I$141,L721>=$M$139,L721<=$N$139),MIN(ROUND(M721,2),633),\"\")","v":""}]
[null,null,null,null,null,null,null,null,"-410,190",null,10,21,null,""]
[null,null,null,null,null,null,null,null,"-410,170",null,9,21,null,""]
[null,null,null,null,null,null,null,null,"-410,150",null,8,21,null,""]
[null,null,null,null,null,null,null,null,"-410,130",null,7,21,null,""]
[null,null,null,null,null,null,null,null,"-410,110",null,6,21,null,""]
[null,null,null,null,null,null,null,null,"-410,90",null,5,21,null,""]
[null,null,null,null,null,null,null,null,"-410,70",null,4,21,null,""]
[null,null,null,null,null,null,null,null,"-410,50",null,3,21,null,""]
[null,null,null,null,null,null,null,null,"-410,30",null,2,21,null,""]
[null,null,null,null,null,null,null,null,"-410,10",null,1,21,null,""]
[null,null,null,null,null,null,null,null,"-430,550",null,28,22,null,""]
[null,null,null,null,null,null,null,null,"-430,530",null,27,22,null,""]
[null,null,null,null,null,null,null,null,"-430,510",null,26,22,null,""]
[null,null,null,null,null,null,null,null,"-430,490",null,25,22,null,""]
[null,null,null,null,null,null,null,null,"-430,470",null,24,22,null,""]
[null,null,null,null,null,null,null,null,"-430,450",null,23,22,null,""]
[null,null,null,null,null,null,null,null,"-430,430",null,22,22,null,""]
[null,null,null,null,null,null,null,null,"-430,410",null,21,22,null,""]
[null,null,null,null,null,null,null,null,"-430,390",null,20,22,null,""]
[null,null,null,null,null,null,null,null,"-430,370",null,19,22,null,""]
[null,null,null,null,null,null,null,null,"-430,350",null,18,22,null,""]
[null,null,null,null,null,null,null,null,"-430,330",null,17,22,null,""]
[null,null,null,null,null,null,null,null,"-430,310",null,16,22,null,""]
[null,null,null,null,null,null,null,null,"-430,290",null,15,22,null,""]
[null,null,null,null,null,null,null,null,"-430,270",null,14,22,null,""]
[null,null,null,null,null,null,null,null,"-430,250",null,13,22,null,""]
[null,null,null,null,null,null,null,null,"-430,230",null,12,22,null,""]
[null,null,null,null,null,null,null,null,"-430,210",null,11,22,null,""]
[null,null,null,null,null,null,null,null,"-430,190",null,10,22,null,""]
[null,null,null,null,null,null,null,null,"-430,170",null,9,22,null,""]
[null,null,null,null,null,null,null,null,"-430,150",null,8,22,null,""]
[null,null,null,null,null,null,null,null,"-430,130",null,7,22,null,""]
[null,null,null,null,null,null,null,null,"-430,110",null,6,22,null,""]
[null,null,null,null,null,null,null,null,"-430,90",null,5,22,null,""]
[null,null,null,null,null,null,null,null,"-430,70",null,4,22,null,""]
[null,null,null,null,null,null,null,null,"-430,50",null,3,22,null,""]
[null,null,null,null,null,null,null,null,"-430,30",null,2,22,null,""]
[null,null,null,null,null,null,null,null,"-430,10",null,1,22,null,""]
[null,null,null,null,null,null,null,null,"-450,550",null,28,23,null,""]
[null,null,null,null,null,null,null,null,"-450,530",null,27,23,null,""]
[null,null,null,null,null,null,null,null,"-450,510",null,26,23,null,""]
[null,null,null,null,null,null,null,null,"-450,490",null,25,23,null,""]
[null,null,null,null,null,null,null,null,"-450,470",null,24,23,null,""]
[null,null,null,null,null,null,null,null,"-450,450",null,23,23,null,""]
[null,null,null,null,null,null,null,null,"-450,430",null,22,23,null,""]
[null,null,null,null,null,null,null,null,"-450,410",null,21,23,null,""]
[null,null,null,null,null,null,null,null,"-450,390",null,20,23,null,""]
[null,null,null,null,null,null,null,null,"-450,370",null,19,23,null,""]
[null,null,null,null,null,null,null,null,"-450,350",null,18,23,null,""]
[null,null,null,null,null,null,null,null,"-450,330",null,17,23,null,""]
[null,null,null,null,null,null,null,null,"-450,310",null,16,23,null,""]
[null,null,null,null,null,null,null,null,"-450,290",null,15,23,null,""]
[null,null,null,null,null,null,null,null,"-450,270",null,14,23,null,""]
[null,null,null,null,null,null,null,null,"-450,250",null,13,23,null,""]
[null,null,null,null,null,null,null,null,"-450,230",null,12,23,null,""]
[null,null,null,null,null,null,null,null,"-450,210",null,11,23,null,""]
[null,null,null,null,null,null,null,null,"-450,190",null,10,23,null,""]
[null,null,null,null,null,null,null,null,"-450,170",null,9,23,null,""]
[null,null,null,null,null,null,null,null,"-450,150",null,8,23,null,""]
[null,null,null,null,null,null,null,null,"-450,130",null,7,23,null,""]
[null,null,null,null,null,null,null,null,"-450,110",null,6,23,null,""]
[null,null,null,null,null,null,null,null,"-450,90",null,5,23,null,""]
[null,null,null,null,null,null,null,null,"-450,70",null,4,23,null,""]
[null,null,null,null,null,null,null,null,"-450,50",null,{"$f":"1+(RIGHT(I785,LEN(I785)-FIND(\",\",I785))-10)/20","v":3},{"$f":"1+((LEFT(I785,FIND(\",\",I785)-1)*-1)-10)/20","v":23},null,{"$f":"IF(AND(K785<=$I$140,K785>=$I$141,L785>=$M$139,L785<=$N$139),MIN(ROUND(M785,2),633),\"\")","v":""}]
[null,null,null,null,null,null,null,null,"-450,30",null,2,23,null,""]
[null,null,null,null,null,null,null,null,"-450,10",null,1,23,null,""]
[null,null,null,null,null,null,null,null,"-470,550",null,28,24,null,""]
[null,null,null,null,null,null,null,null,"-470,530",null,27,24,null,""]
[null,null,null,null,null,null,null,null,"-470,510",null,26,24,null,""]
[null,null,null,null,null,null,null,null,"-470,490",null,25,24,null,""]
[null,null,null,null,null,null,null,null,"-470,470",null,24,24,null,""]
[null,null,null,null,null,null,null,null,"-470,450",null,23,24,null,""]
[null,null,null,null,null,null,null,null,"-470,430",null,22,24,null,""]
[null,null,null,null,null,null,null,null,"-470,410",null,21,24,null,""]
[null,null,null,null,null,null,null,null,"-470,390",null,20,24,null,""]
[null,null,null,null,null,null,null,null,"-470,370",null,19,24,null,""]
[null,null,null,null,null,null,null,null,"-470,350",null,18,24,null,""]
[null,null,null,null,null,null,null,null,"-470,330",null,17,24,null,""]
[null,null,null,null,null,null,null,null,"-470,310",null,16,24,null,""]
[null,null,null,null,null,null,null,null,"-470,290",null,15,24,null,""]
[null,null,null,null,null,null,null,null,"-470,270",null,14,24,null,""]
[null,null,null,null,null,null,null,null,"-470,250",null,13,24,null,""]
[null,null,null,null,null,null,null,null,"-470,230",null,12,24,null,""]
[null,null,null,null,null,null,null,null,"-470,210",null,11,24,null,""]
[null,null,null,null,null,null,null,null,"-470,190",null,10,24,null,""]
[null,null,null,null,null,null,null,null,"-470,170",null,9,24,null,""]
[null,null,null,null,null,null,null,null,"-470,150",null,8,24,null,""]
[null,null,null,null,null,null,null,null,"-470,130",null,7,24,null,""]
[null,null,null,null,null,null,null,null,"-470,110",null,6,24,null,""]
[null,null,null,null,null,null,null,null,"-470,90",null,5,24,null,""]
[null,null,null,null,null,null,null,null,"-470,70",null,4,24,null,""]
[null,null,null,null,null,null,null,null,"-470,50",null,3,24,null,""]
[null,null,null,null,null,null,null,null,"-470,30",null,2,24,null,""]
[null,null,null,null,null,null,null,null,"-470,10",null,1,24,null,""]
[null,null,null,null,null,null,null,null,"-490,550",null,28,25,null,""]
[null,null,null,null,null,null,null,null,"-490,530",null,27,25,null,""]
[null,null,null,null,null,null,null,null,"-490,510",null,26,25,null,""]
[null,null,null,null,null,null,null,null,"-490,490",null,25,25,null,""]
[null,null,null,null,null,null,null,null,"-490,470",null,24,25,null,""]
[null,null,null,null,null,null,null,null,"-490,450",null,23,25,null,""]
[null,null,null,null,null,null,null,null,"-490,430",null,22,25,null,""]
[null,null,null,null,null,null,null,null,"-490,410",null,21,25,null,""]
[null,null,null,null,null,null,null,null,"-490,390",null,20,25,null,""]
[null,null,null,null,null,null,null,null,"-490,370",null,19,25,null,""]
[null,null,null,null,null,null,null,null,"-490,350",null,18,25,null,""]
[null,null,null,null,null,null,null,null,"-490,330",null,17,25,null,""]
[null,null,null,null,null,null,null,null,"-490,310",null,16,25,null,""]
[null,null,null,null,null,null,null,null,"-490,290",null,15,25,null,""]
[null,null,null,null,null,null,null,null,"-490,270",null,14,25,null,""]
[null,null,null,null,null,null,null,null,"-490,250",null,13,25,null,""]
[null,null,null,null,null,null,null,null,"-490,230",null,12,25,null,""]
[null,null,null,null,null,null,null,null,"-490,210",null,11,25,null,""]
[null,null,null,null,null,null,null,null,"-490,190",null,10,25,null,""]
[null,null,null,null,null,null,null,null,"-490,170",null,9,25,null,""]
[null,null,null,null,null,null,null,null,"-490,150",null,8,25,null,""]
[null,null,null,null,null,null,null,null,"-490,130",null,7,25,null,""]
[null,null,null,null,null,null,null,null,"-490,110",null,6,25,null,""]
[null,null,null,null,null,null,null,null,"-490,90",null,5,25,null,""]
[null,null,null,null,null,null,null,null,"-490,70",null,4,25,null,""]
[null,null,null,null,null,null,null,null,"-490,50",null,3,25,null,""]
[null,null,null,null,null,null,null,null,"-490,30",null,2,25,null,""]
[null,null,null,null,null,null,null,null,"-490,10",null,1,25,null,""]
[null,null,null,null,null,null,null,null,"-510,550",null,28,26,null,""]
[null,null,null,null,null,null,null,null,"-510,530",null,27,26,null,""]
[null,null,null,null,null,null,null,null,"-510,510",null,26,26,null,""]
[null,null,null,null,null,null,null,null,"-510,490",null,25,26,null,""]
[null,null,null,null,null,null,null,null,"-510,470",null,24,26,null,""]
[null,null,null,null,null,null,null,null,"-510,450",null,{"$f":"1+(RIGHT(I849,LEN(I849)-FIND(\",\",I849))-10)/20","v":23},{"$f":"1+((LEFT(I849,FIND(\",\",I849)-1)*-1)-10)/20","v":26},null,{"$f":"IF(AND(K849<=$I$140,K849>=$I$141,L849>=$M$139,L849<=$N$139),MIN(ROUND(M849,2),633),\"\")","v":""}]
[null,null,null,null,null,null,null,null,"-510,430",null,22,26,null,""]
[null,null,null,null,null,null,null,null,"-510,410",null,21,26,null,""]
[null,null,null,null,null,null,null,null,"-510,390",null,20,26,null,""]
[null,null,null,null,null,null,null,null,"-510,370",null,19,26,null,""]
[null,null,null,null,null,null,null,null,"-510,350",null,18,26,null,""]
[null,null,null,null,null,null,null,null,"-510,330",null,17,26,null,""]
[null,null,null,null,null,null,null,null,"-510,310",null,16,26,null,""]
[null,null,null,null,null,null,null,null,"-510,290",null,15,26,null,""]
[null,null,null,null,null,null,null,null,"-510,270",null,14,26,null,""]
[null,null,null,null,null,null,null,null,"-510,250",null,13,26,null,""]
[null,null,null,null,null,null,null,null,"-510,230",null,12,26,null,""]
[null,null,null,null,null,null,null,null,"-510,210",null,11,26,null,""]
[null,null,null,null,null,null,null,null,"-510,190",null,10,26,null,""]
[null,null,null,null,null,null,null,null,"-510,170",null,9,26,null,""]
[null,null,null,null,null,null,null,null,"-510,150",null,8,26,null,""]
[null,null,null,null,null,null,null,null,"-510,130",null,7,26,null,""]
[null,null,null,null,null,null,null,null,"-510,110",null,6,26,null,""]
[null,null,null,null,null,null,null,null,"-510,90",null,5,26,null,""]
[null,null,null,null,null,null,null,null,"-510,70",null,4,26,null,""]
[null,null,null,null,null,null,null,null,"-510,50",null,3,26,null,""]
[null,null,null,null,null,null,null,null,"-510,30",null,2,26,null,""]
[null,null,null,null,null,null,null,null,"-510,10",null,1,26,null,""]
[null,null,null,null,null,null,null,null,"-530,550",null,28,27,null,""]
[null,null,null,null,null,null,null,null,"-530,530",null,27,27,null,""]
[null,null,null,null,null,null,null,null,"-530,510",null,26,27,null,""]
[null,null,null,null,null,null,null,null,"-530,490",null,25,27,null,""]
[null,null,null,null,null,null,null,null,"-530,470",null,24,27,null,""]
[null,null,null,null,null,null,null,null,"-530,450",null,23,27,null,""]
[null,null,null,null,null,null,null,null,"-530,430",null,22,27,null,""]
[null,null,null,null,null,null,null,null,"-530,410",null,21,27,null,""]
[null,null,null,null,null,null,null,null,"-530,390",null,20,27,null,""]
[null,null,null,null,null,null,null,null,"-530,370",null,19,27,null,""]
[null,null,null,null,null,null,null,null,"-530,350",null,18,27,null,""]
[null,null,null,null,null,null,null,null,"-530,330",null,17,27,null,""]
[null,null,null,null,null,null,null,null,"-530,310",null,16,27,null,""]
[null,null,null,null,null,null,null,null,"-530,290",null,15,27,null,""]
[null,null,null,null,null,null,null,null,"-530,270",null,14,27,null,""]
[null,null,null,null,null,null,null,null,"-530,250",null,13,27,null,""]
[null,null,null,null,null,null,null,null,"-530,230",null,12,27,null,""]
[null,null,null,null,null,null,null,null,"-530,210",null,11,27,null,""]
[null,null,null,null,null,null,null,null,"-530,190",null,10,27,null,""]
[null,null,null,null,null,null,null,null,"-530,170",null,9,27,null,""]
[null,null,null,null,null,null,null,null,"-530,150",null,8,27,null,""]
[null,null,null,null,null,null,null,null,"-530,130",null,7,27,null,""]
[null,null,null,null,null,null,null,null,"-530,110",null,6,27,null,""]
[null,null,null,null,null,null,null,null,"-530,90",null,5,27,null,""]
[null,null,null,null,null,null,null,null,"-530,70",null,4,27,null,""]
[null,null,null,null,null,null,null,null,"-530,50",null,3,27,null,""]
[null,null,null,null,null,null,null,null,"-530,30",null,2,27,null,""]
[null,null,null,null,null,null,null,null,"-530,10",null,1,27,null,""]
[null,null,null,null,null,null,null,null,"-550,550",null,28,28,null,""]
[null,null,null,null,null,null,null,null,"-550,530",null,27,28,null,""]
[null,null,null,null,null,null,null,null,"-550,510",null,26,28,null,""]
[null,null,null,null,null,null,null,null,"-550,490",null,25,28,null,""]
[null,null,null,null,null,null,null,null,"-550,470",null,24,28,null,""]
[null,null,null,null,null,null,null,null,"-550,450",null,23,28,null,""]
[null,null,null,null,null,null,null,null,"-550,430",null,22,28,null,""]
[null,null,null,null,null,null,null,null,"-550,410",null,21,28,null,""]
[null,null,null,null,null,null,null,null,"-550,390",null,20,28,null,""]
[null,null,null,null,null,null,null,null,"-550,370",null,19,28,null,""]
[null,null,null,null,null,null,null,null,"-550,350",null,18,28,null,""]
[null,null,null,null,null,null,null,null,"-550,330",null,17,28,null,""]
[null,null,null,null,null,null,null,null,"-550,310",null,16,28,null,""]
[null,null,null,null,null,null,null,null,"-550,290",null,{"$f":"1+(RIGHT(I913,LEN(I913)-FIND(\",\",I913))-10)/20","v":15},{"$f":"1+((LEFT(I913,FIND(\",\",I913)-1)*-1)-10)/20","v":28},null,{"$f":"IF(AND(K913<=$I$140,K913>=$I$141,L913>=$M$139,L913<=$N$139),MIN(ROUND(M913,2),633),\"\")","v":""}]
[null,null,null,null,null,null,null,null,"-550,270",null,14,28,null,""]
[null,null,null,null,null,null,null,null,"-550,250",null,13,28,null,""]
[null,null,null,null,null,null,null,null,"-550,230",null,12,28,null,""]
[null,null,null,null,null,null,null,null,"-550,210",null,11,28,null,""]
[null,null,null,null,null,null,null,null,"-550,190",null,10,28,null,""]
[null,null,null,null,null,null,null,null,"-550,170",null,9,28,null,""]
[null,null,null,null,null,null,null,null,"-550,150",null,8,28,null,""]
[null,null,null,null,null,null,null,null,"-550,130",null,7,28,null,""]
[null,null,null,null,null,null,null,null,"-550,110",null,6,28,null,""]
[null,null,null,null,null,null,null,null,"-550,90",null,5,28,null,""]
[null,null,null,null,null,null,null,null,"-550,70",null,4,28,null,""]
[null,null,null,null,null,null,null,null,"-550,50",null,3,28,null,""]
[null,null,null,null,null,null,null,null,"-550,30",null,2,28,null,""]
[null,null,null,null,null,null,null,null,"-550,10",null,1,28,null,""]
[null,null,null,null,null,null,null,null,"-570,550",null,28,29,null,""]
[null,null,null,null,null,null,null,null,"-570,530",null,27,29,null,""]
[null,null,null,null,null,null,null,null,"-570,510",null,26,29,null,""]
[null,null,null,null,null,null,null,null,"-570,490",null,25,29,null,""]
[null,null,null,null,null,null,null,null,"-570,470",null,24,29,null,""]
[null,null,null,null,null,null,null,null,"-570,450",null,23,29,null,""]
[null,null,null,null,null,null,null,null,"-570,430",null,22,29,null,""]
[null,null,null,null,null,null,null,null,"-570,410",null,21,29,null,""]
[null,null,null,null,null,null,null,null,"-570,390",null,20,29,null,""]
[null,null,null,null,null,null,null,null,"-570,370",null,19,29,null,""]
[null,null,null,null,null,null,null,null,"-570,350",null,18,29,null,""]
[null,null,null,null,null,null,null,null,"-570,330",null,17,29,null,""]
[null,null,null,null,null,null,null,null,"-570,310",null,16,29,null,""]
[null,null,null,null,null,null,null,null,"-570,290",null,15,29,null,""]
[null,null,null,null,null,null,null,null,"-570,270",null,14,29,null,""]
[null,null,null,null,null,null,null,null,"-570,250",null,13,29,null,""]
[null,null,null,null,null,null,null,null,"-570,230",null,12,29,null,""]
[null,null,null,null,null,null,null,null,"-570,210",null,11,29,null,""]
[null,null,null,null,null,null,null,null,"-570,190",null,10,29,null,""]
[null,null,null,null,null,null,null,null,"-570,170",null,9,29,null,""]
[null,null,null,null,null,null,null,null,"-570,150",null,8,29,null,""]
[null,null,null,null,null,null,null,null,"-570,130",null,7,29,null,""]
[null,null,null,null,null,null,null,null,"-570,110",null,6,29,null,""]
[null,null,null,null,null,null,null,null,"-570,90",null,5,29,null,""]
[null,null,null,null,null,null,null,null,"-570,70",null,4,29,null,""]
[null,null,null,null,null,null,null,null,"-570,50",null,3,29,null,""]
[null,null,null,null,null,null,null,null,"-570,30",null,2,29,null,""]
[null,null,null,null,null,null,null,null,"-570,10",null,1,29,null,""]
[null,null,null,null,null,null,null,null,"-590,550",null,28,30,null,""]
[null,null,null,null,null,null,null,null,"-590,530",null,27,30,null,""]
[null,null,null,null,null,null,null,null,"-590,510",null,26,30,null,""]
[null,null,null,null,null,null,null,null,"-590,490",null,25,30,null,""]
[null,null,null,null,null,null,null,null,"-590,470",null,24,30,null,""]
[null,null,null,null,null,null,null,null,"-590,450",null,23,30,null,""]
[null,null,null,null,null,null,null,null,"-590,430",null,22,30,null,""]
[null,null,null,null,null,null,null,null,"-590,410",null,21,30,null,""]
[null,null,null,null,null,null,null,null,"-590,390",null,20,30,null,""]
[null,null,null,null,null,null,null,null,"-590,370",null,19,30,null,""]
[null,null,null,null,null,null,null,null,"-590,350",null,18,30,null,""]
[null,null,null,null,null,null,null,null,"-590,330",null,17,30,null,""]
[null,null,null,null,null,null,null,null,"-590,310",null,16,30,null,""]
[null,null,null,null,null,null,null,null,"-590,290",null,15,30,null,""]
[null,null,null,null,null,null,null,null,"-590,270",null,14,30,null,""]
[null,null,null,null,null,null,null,null,"-590,250",null,13,30,null,""]
[null,null,null,null,null,null,null,null,"-590,230",null,12,30,null,""]
[null,null,null,null,null,null,null,null,"-590,210",null,11,30,null,""]
[null,null,null,null,null,null,null,null,"-590,190",null,10,30,null,""]
[null,null,null,null,null,null,null,null,"-590,170",null,9,30,null,""]
[null,null,null,null,null,null,null,null,"-590,150",null,8,30,null,""]
[null,null,null,null,null,null,null,null,"-590,130",null,{"$f":"1+(RIGHT(I977,LEN(I977)-FIND(\",\",I977))-10)/20","v":7},{"$f":"1+((LEFT(I977,FIND(\",\",I977)-1)*-1)-10)/20","v":30},null,{"$f":"IF(AND(K977<=$I$140,K977>=$I$141,L977>=$M$139,L977<=$N$139),MIN(ROUND(M977,2),633),\"\")","v":""}]
[null,null,null,null,null,null,null,null,"-590,110",null,6,30,null,""]
[null,null,null,null,null,null,null,null,"-590,90",null,5,30,null,""]
[null,null,null,null,null,null,null,null,"-590,70",null,4,30,null,""]
[null,null,null,null,null,null,null,null,"-590,50",null,3,30,null,""]
[null,null,null,null,null,null,null,null,"-590,30",null,2,30,null,""]
[null,null,null,null,null,null,null,null,"-590,10",null,1,30,null,""]
[null,null,null,null,null,null,null,null,"-610,550",null,28,31,null,""]
[null,null,null,null,null,null,null,null,"-610,530",null,27,31,null,""]
[null,null,null,null,null,null,null,null,"-610,510",null,26,31,null,""]
[null,null,null,null,null,null,null,null,"-610,490",null,25,31,null,""]
[null,null,null,null,null,null,null,null,"-610,470",null,24,31,null,""]
[null,null,null,null,null,null,null,null,"-610,450",null,23,31,null,""]
[null,null,null,null,null,null,null,null,"-610,430",null,22,31,null,""]
[null,null,null,null,null,null,null,null,"-610,410",null,21,31,null,""]
[null,null,null,null,null,null,null,null,"-610,390",null,20,31,null,""]
[null,null,null,null,null,null,null,null,"-610,370",null,19,31,null,""]
[null,null,null,null,null,null,null,null,"-610,350",null,18,31,null,""]
[null,null,null,null,null,null,null,null,"-610,330",null,17,31,null,""]
[null,null,null,null,null,null,null,null,"-610,310",null,16,31,null,""]
[null,null,null,null,null,null,null,null,"-610,290",null,15,31,null,""]
[null,null,null,null,null,null,null,null,"-610,270",null,14,31,null,""]
[null,null,null,null,null,null,null,null,"-610,250",null,13,31,null,""]
[null,null,null,null,null,null,null,null,"-610,230",null,12,31,null,""]
[null,null,null,null,null,null,null,null,"-610,210",null,11,31,null,""]
[null,null,null,null,null,null,null,null,"-610,190",null,10,31,null,""]
[null,null,null,null,null,null,null,null,"-610,170",null,9,31,null,""]
[null,null,null,null,null,null,null,null,"-610,150",null,8,31,null,""]
[null,null,null,null,null,null,null,null,"-610,130",null,7,31,null,""]
[null,null,null,null,null,null,null,null,"-610,110",null,6,31,null,""]
[null,null,null,null,null,null,null,null,"-610,90",null,5,31,null,""]
[null,null,null,null,null,null,null,null,"-610,70",null,4,31,null,""]
[null,null,null,null,null,null,null,null,"-610,50",null,3,31,null,""]
[null,null,null,null,null,null,null,null,"-610,30",null,2,31,null,""]
[null,null,null,null,null,null,null,null,"-610,10",null,1,31,null,""]
[null,null,null,null,null,null,null,null,"-630,550",null,28,32,null,""]
[null,null,null,null,null,null,null,null,"-630,530",null,27,32,null,""]
[null,null,null,null,null,null,null,null,"-630,510",null,26,32,null,""]
[null,null,null,null,null,null,null,null,"-630,490",null,25,32,null,""]
[null,null,null,null,null,null,null,null,"-630,470",null,24,32,null,""]
[null,null,null,null,null,null,null,null,"-630,450",null,23,32,null,""]
[null,null,null,null,null,null,null,null,"-630,430",null,22,32,null,""]
[null,null,null,null,null,null,null,null,"-630,410",null,21,32,null,""]
[null,null,null,null,null,null,null,null,"-630,390",null,20,32,null,""]
[null,null,null,null,null,null,null,null,"-630,370",null,19,32,null,""]
[null,null,null,null,null,null,null,null,"-630,350",null,18,32,null,""]
[null,null,null,null,null,null,null,null,"-630,330",null,17,32,null,""]
[null,null,null,null,null,null,null,null,"-630,310",null,16,32,null,""]
[null,null,null,null,null,null,null,null,"-630,290",null,15,32,null,""]
[null,null,null,null,null,null,null,null,"-630,270",null,14,32,null,""]
[null,null,null,null,null,null,null,null,"-630,250",null,13,32,null,""]
[null,null,null,null,null,null,null,null,"-630,230",null,12,32,null,""]
[null,null,null,null,null,null,null,null,"-630,210",null,11,32,null,""]
[null,null,null,null,null,null,null,null,"-630,190",null,10,32,null,""]
[null,null,null,null,null,null,null,null,"-630,170",null,9,32,null,""]
[null,null,null,null,null,null,null,null,"-630,150",null,8,32,null,""]
[null,null,null,null,null,null,null,null,"-630,130",null,7,32,null,""]
[null,null,null,null,null,null,null,null,"-630,110",null,6,32,null,""]
[null,null,null,null,null,null,null,null,"-630,90",null,5,32,null,""]
[null,null,null,null,null,null,null,null,"-630,70",null,4,32,null,""]
[null,null,null,null,null,null,null,null,"-630,50",null,3,32,null,""]
[null,null,null,null,null,null,null,null,"-630,30",null,2,32,null,""]
[null,null,null,null,null,null,null,null,"-630,10",null,1,32,null,""]
[null,null,null,null,null,null,null,null,"-650,550",null,28,33,null,""]
[null,null,null,null,null,null,null,null,"-650,530",null,{"$f":"1+(RIGHT(I1041,LEN(I1041)-FIND(\",\",I1041))-10)/20","v":27},{"$f":"1+((LEFT(I1041,FIND(\",\",I1041)-1)*-1)-10)/20","v":33},null,{"$f":"IF(AND(K1041<=$I$140,K1041>=$I$141,L1041>=$M$139,L1041<=$N$139),MIN(ROUND(M1041,2),633),\"\")","v":""}]
[null,null,null,null,null,null,null,null,"-650,510",null,26,33,null,""]
[null,null,null,null,null,null,null,null,"-650,490",null,25,33,null,""]
[null,null,null,null,null,null,null,null,"-650,470",null,24,33,null,""]
[null,null,null,null,null,null,null,null,"-650,450",null,23,33,null,""]
[null,null,null,null,null,null,null,null,"-650,430",null,22,33,null,""]
[null,null,null,null,null,null,null,null,"-650,410",null,21,33,null,""]
[null,null,null,null,null,null,null,null,"-650,390",null,20,33,null,""]
[null,null,null,null,null,null,null,null,"-650,370",null,19,33,null,""]
[null,null,null,null,null,null,null,null,"-650,350",null,18,33,null,""]
[null,null,null,null,null,null,null,null,"-650,330",null,17,33,null,""]
[null,null,null,null,null,null,null,null,"-650,310",null,16,33,null,""]
[null,null,null,null,null,null,null,null,"-650,290",null,15,33,null,""]
[null,null,null,null,null,null,null,null,"-650,270",null,14,33,null,""]
[null,null,null,null,null,null,null,null,"-650,250",null,13,33,null,""]
[null,null,null,null,null,null,null,null,"-650,230",null,12,33,null,""]
[null,null,null,null,null,null,null,null,"-650,210",null,11,33,null,""]
[null,null,null,null,null,null,null,null,"-650,190",null,10,33,null,""]
[null,null,null,null,null,null,null,null,"-650,170",null,9,33,null,""]
[null,null,null,null,null,null,null,null,"-650,150",null,8,33,null,""]
[null,null,null,null,null,null,null,null,"-650,130",null,7,33,null,""]
[null,null,null,null,null,null,null,null,"-650,110",null,6,33,null,""]
[null,null,null,null,null,null,null,null,"-650,90",null,5,33,null,""]
[null,null,null,null,null,null,null,null,"-650,70",null,4,33,null,""]
[null,null,null,null,null,null,null,null,"-650,50",null,3,33,null,""]
[null,null,null,null,null,null,null,null,"-650,30",null,2,33,null,""]
[null,null,null,null,null,null,null,null,"-650,10",null,1,33,null,""]
[null,null,null,null,null,null,null,null,"-670,550",null,28,34,null,""]
[null,null,null,null,null,null,null,null,"-670,530",null,27,34,null,""]
[null,null,null,null,null,null,null,null,"-670,510",null,26,34,null,""]
[null,null,null,null,null,null,null,null,"-670,490",null,25,34,null,""]
[null,null,null,null,null,null,null,null,"-670,470",null,24,34,null,""]
[null,null,null,null,null,null,null,null,"-670,450",null,23,34,null,""]
[null,null,null,null,null,null,null,null,"-670,430",null,22,34,null,""]
[null,null,null,null,null,null,null,null,"-670,410",null,21,34,null,""]
[null,null,null,null,null,null,null,null,"-670,390",null,20,34,null,""]
[null,null,null,null,null,null,null,null,"-670,370",null,19,34,null,""]
[null,null,null,null,null,null,null,null,"-670,350",null,18,34,null,""]
[null,null,null,null,null,null,null,null,"-670,330",null,17,34,null,""]
[null,null,null,null,null,null,null,null,"-670,310",null,16,34,null,""]
[null,null,null,null,null,null,null,null,"-670,290",null,15,34,null,""]
[null,null,null,null,null,null,null,null,"-670,270",null,14,34,null,""]
[null,null,null,null,null,null,null,null,"-670,250",null,13,34,null,""]
[null,null,null,null,null,null,null,null,"-670,230",null,12,34,null,""]
[null,null,null,null,null,null,null,null,"-670,210",null,11,34,null,""]
[null,null,null,null,null,null,null,null,"-670,190",null,10,34,null,""]
[null,null,null,null,null,null,null,null,"-670,170",null,9,34,null,""]
[null,null,null,null,null,null,null,null,"-670,150",null,8,34,null,""]
[null,null,null,null,null,null,null,null,"-670,130",null,7,34,null,""]
[null,null,null,null,null,null,null,null,"-670,110",null,6,34,null,""]
[null,null,null,null,null,null,null,null,"-670,90",null,5,34,null,""]
[null,null,null,null,null,null,null,null,"-670,70",null,4,34,null,""]
[null,null,null,null,null,null,null,null,"-670,50",null,3,34,null,""]
[null,null,null,null,null,null,null,null,"-670,30",null,2,34,null,""]
[null,null,null,null,null,null,null,null,"-670,10",null,1,34,null,""]
[null,null,null,null,null,null,null,null,"-690,550",null,28,35,null,""]
[null,null,null,null,null,null,null,null,"-690,530",null,27,35,null,""]
[null,null,null,null,null,null,null,null,"-690,510",null,26,35,null,""]
[null,null,null,null,null,null,null,null,"-690,490",null,25,35,null,""]
[null,null,null,null,null,null,null,null,"-690,470",null,24,35,null,""]
[null,null,null,null,null,null,null,null,"-690,450",null,23,35,null,""]
[null,null,null,null,null,null,null,null,"-690,430",null,22,35,null,""]
[null,null,null,null,null,null,null,null,"-690,410",null,21,35,null,""]
[null,null,null,null,null,null,null,null,"-690,390",null,20,35,null,""]
[null,null,null,null,null,null,null,null,"-690,370",null,{"$f":"1+(RIGHT(I1105,LEN(I1105)-FIND(\",\",I1105))-10)/20","v":19},{"$f":"1+((LEFT(I1105,FIND(\",\",I1105)-1)*-1)-10)/20","v":35},null,{"$f":"IF(AND(K1105<=$I$140,K1105>=$I$141,L1105>=$M$139,L1105<=$N$139),MIN(ROUND(M1105,2),633),\"\")","v":""}]
[null,null,null,null,null,null,null,null,"-690,350",null,18,35,null,""]
[null,null,null,null,null,null,null,null,"-690,330",null,17,35,null,""]
[null,null,null,null,null,null,null,null,"-690,310",null,16,35,null,""]
[null,null,null,null,null,null,null,null,"-690,290",null,15,35,null,""]
[null,null,null,null,null,null,null,null,"-690,270",null,14,35,null,""]
[null,null,null,null,null,null,null,null,"-690,250",null,13,35,null,""]
[null,null,null,null,null,null,null,null,"-690,230",null,12,35,null,""]
[null,null,null,null,null,null,null,null,"-690,210",null,11,35,null,""]
[null,null,null,null,null,null,null,null,"-690,190",null,10,35,null,""]
[null,null,null,null,null,null,null,null,"-690,170",null,9,35,null,""]
[null,null,null,null,null,null,null,null,"-690,150",null,8,35,null,""]
[null,null,null,null,null,null,null,null,"-690,130",null,7,35,null,""]
[null,null,null,null,null,null,null,null,"-690,110",null,6,35,null,""]
[null,null,null,null,null,null,null,null,"-690,90",null,5,35,null,""]
[null,null,null,null,null,null,null,null,"-690,70",null,4,35,null,""]
[null,null,null,null,null,null,null,null,"-690,50",null,3,35,null,""]
[null,null,null,null,null,null,null,null,"-690,30",null,2,35,null,""]
[null,null,null,null,null,null,null,null,"-690,10",null,1,35,null,""]
[null,null,null,null,null,null,null,null,"-710,550",null,28,36,null,""]
[null,null,null,null,null,null,null,null,"-710,530",null,27,36,null,""]
[null,null,null,null,null,null,null,null,"-710,510",null,26,36,null,""]
[null,null,null,null,null,null,null,null,"-710,490",null,25,36,null,""]
[null,null,null,null,null,null,null,null,"-710,470",null,24,36,null,""]
[null,null,null,null,null,null,null,null,"-710,450",null,23,36,null,""]
[null,null,null,null,null,null,null,null,"-710,430",null,22,36,null,""]
[null,null,null,null,null,null,null,null,"-710,410",null,21,36,null,""]
[null,null,null,null,null,null,null,null,"-710,390",null,20,36,null,""]
[null,null,null,null,null,null,null,null,"-710,370",null,19,36,null,""]
[null,null,null,null,null,null,null,null,"-710,350",null,18,36,null,""]
[null,null,null,null,null,null,null,null,"-710,330",null,17,36,null,""]
[null,null,null,null,null,null,null,null,"-710,310",null,16,36,null,""]
[null,null,null,null,null,null,null,null,"-710,290",null,15,36,null,""]
[null,null,null,null,null,null,null,null,"-710,270",null,14,36,null,""]
[null,null,null,null,null,null,null,null,"-710,250",null,13,36,null,""]
[null,null,null,null,null,null,null,null,"-710,230",null,12,36,null,""]
[null,null,null,null,null,null,null,null,"-710,210",null,11,36,null,""]
[null,null,null,null,null,null,null,null,"-710,190",null,10,36,null,""]
[null,null,null,null,null,null,null,null,"-710,170",null,9,36,null,""]
[null,null,null,null,null,null,null,null,"-710,150",null,8,36,null,""]
[null,null,null,null,null,null,null,null,"-710,130",null,7,36,null,""]
[null,null,null,null,null,null,null,null,"-710,110",null,6,36,null,""]
[null,null,null,null,null,null,null,null,"-710,90",null,5,36,null,""]
[null,null,null,null,null,null,null,null,"-710,70",null,4,36,null,""]
[null,null,null,null,null,null,null,null,"-710,50",null,3,36,null,""]
[null,null,null,null,null,null,null,null,"-710,30",null,2,36,null,""]
[null,null,null,null,null,null,null,null,"-710,10",null,1,36,null,""]
[null,null,null,null,null,null,null,null,"-730,550",null,28,37,null,""]
[null,null,null,null,null,null,null,null,"-730,530",null,27,37,null,""]
[null,null,null,null,null,null,null,null,"-730,510",null,26,37,null,""]
[null,null,null,null,null,null,null,null,"-730,490",null,25,37,null,""]
[null,null,null,null,null,null,null,null,"-730,470",null,24,37,null,""]
[null,null,null,null,null,null,null,null,"-730,450",null,23,37,null,""]
[null,null,null,null,null,null,null,null,"-730,430",null,22,37,null,""]
[null,null,null,null,null,null,null,null,"-730,410",null,21,37,null,""]
[null,null,null,null,null,null,null,null,"-730,390",null,20,37,null,""]
[null,null,null,null,null,null,null,null,"-730,370",null,19,37,null,""]
[null,null,null,null,null,null,null,null,"-730,350",null,18,37,null,""]
[null,null,null,null,null,null,null,null,"-730,330",null,17,37,null,""]
[null,null,null,null,null,null,null,null,"-730,310",null,16,37,null,""]
[null,null,null,null,null,null,null,null,"-730,290",null,15,37,null,""]
[null,null,null,null,null,null,null,null,"-730,270",null,14,37,null,""]
[null,null,null,null,null,null,null,null,"-730,250",null,13,37,null,""]
[null,null,null,null,null,null,null,null,"-730,230",null,12,37,null,""]
[null,null,null,null,null,null,null,null,"-730,210",null,{"$f":"1+(RIGHT(I1169,LEN(I1169)-FIND(\",\",I1169))-10)/20","v":11},{"$f":"1+((LEFT(I1169,FIND(\",\",I1169)-1)*-1)-10)/20","v":37},null,{"$f":"IF(AND(K1169<=$I$140,K1169>=$I$141,L1169>=$M$139,L1169<=$N$139),MIN(ROUND(M1169,2),633),\"\")","v":""}]
[null,null,null,null,null,null,null,null,"-730,190",null,10,37,null,""]
[null,null,null,null,null,null,null,null,"-730,170",null,9,37,null,""]
[null,null,null,null,null,null,null,null,"-730,150",null,8,37,null,""]
[null,null,null,null,null,null,null,null,"-730,130",null,7,37,null,""]
[null,null,null,null,null,null,null,null,"-730,110",null,6,37,null,""]
[null,null,null,null,null,null,null,null,"-730,90",null,5,37,null,""]
[null,null,null,null,null,null,null,null,"-730,70",null,4,37,null,""]
[null,null,null,null,null,null,null,null,"-730,50",null,3,37,null,""]
[null,null,null,null,null,null,null,null,"-730,30",null,2,37,null,""]
[null,null,null,null,null,null,null,null,"-730,10",null,1,37,null,""]
[null,null,null,null,null,null,null,null,"-750,550",null,28,38,null,""]
[null,null,null,null,null,null,null,null,"-750,530",null,27,38,null,""]
[null,null,null,null,null,null,null,null,"-750,510",null,26,38,null,""]
[null,null,null,null,null,null,null,null,"-750,490",null,25,38,null,""]
[null,null,null,null,null,null,null,null,"-750,470",null,24,38,null,""]
[null,null,null,null,null,null,null,null,"-750,450",null,23,38,null,""]
[null,null,null,null,null,null,null,null,"-750,430",null,22,38,null,""]
[null,null,null,null,null,null,null,null,"-750,410",null,21,38,null,""]
[null,null,null,null,null,null,null,null,"-750,390",null,20,38,null,""]
[null,null,null,null,null,null,null,null,"-750,370",null,19,38,null,""]
[null,null,null,null,null,null,null,null,"-750,350",null,18,38,null,""]
[null,null,null,null,null,null,null,null,"-750,330",null,17,38,null,""]
[null,null,null,null,null,null,null,null,"-750,310",null,16,38,null,""]
[null,null,null,null,null,null,null,null,"-750,290",null,15,38,null,""]
[null,null,null,null,null,null,null,null,"-750,270",null,14,38,null,""]
[null,null,null,null,null,null,null,null,"-750,250",null,13,38,null,""]
[null,null,null,null,null,null,null,null,"-750,230",null,12,38,null,""]
[null,null,null,null,null,null,null,null,"-750,210",null,11,38,null,""]
[null,null,null,null,null,null,null,null,"-750,190",null,10,38,null,""]
[null,null,null,null,null,null,null,null,"-750,170",null,9,38,null,""]
[null,null,null,null,null,null,null,null,"-750,150",null,8,38,null,""]
[null,null,null,null,null,null,null,null,"-750,130",null,7,38,null,""]
[null,null,null,null,null,null,null,null,"-750,110",null,6,38,null,""]
[null,null,null,null,null,null,null,null,"-750,90",null,5,38,null,""]
[null,null,null,null,null,null,null,null,"-750,70",null,4,38,null,""]
[null,null,null,null,null,null,null,null,"-750,50",null,3,38,null,""]
[null,null,null,null,null,null,null,null,"-750,30",null,2,38,null,""]
[null,null,null,null,null,null,null,null,"-750,10",null,1,38,null,""]
[null,null,null,null,null,null,null,null,"-770,550",null,28,39,null,""]
[null,null,null,null,null,null,null,null,"-770,530",null,27,39,null,""]
[null,null,null,null,null,null,null,null,"-770,510",null,26,39,null,""]
[null,null,null,null,null,null,null,null,"-770,490",null,25,39,null,""]
[null,null,null,null,null,null,null,null,"-770,470",null,24,39,null,""]
[null,null,null,null,null,null,null,null,"-770,450",null,23,39,null,""]
[null,null,null,null,null,null,null,null,"-770,430",null,22,39,null,""]
[null,null,null,null,null,null,null,null,"-770,410",null,21,39,null,""]
[null,null,null,null,null,null,null,null,"-770,390",null,20,39,null,""]
[null,null,null,null,null,null,null,null,"-770,370",null,19,39,null,""]
[null,null,null,null,null,null,null,null,"-770,350",null,18,39,null,""]
[null,null,null,null,null,null,null,null,"-770,330",null,17,39,null,""]
[null,null,null,null,null,null,null,null,"-770,310",null,16,39,null,""]
[null,null,null,null,null,null,null,null,"-770,290",null,15,39,null,""]
[null,null,null,null,null,null,null,null,"-770,270",null,14,39,null,""]
[null,null,null,null,null,null,null,null,"-770,250",null,13,39,null,""]
[null,null,null,null,null,null,null,null,"-770,230",null,12,39,null,""]
[null,null,null,null,null,null,null,null,"-770,210",null,11,39,null,""]
[null,null,null,null,null,null,null,null,"-770,190",null,10,39,null,""]
[null,null,null,null,null,null,null,null,"-770,170",null,9,39,null,""]
[null,null,null,null,null,null,null,null,"-770,150",null,8,39,null,""]
[null,null,null,null,null,null,null,null,"-770,130",null,7,39,null,""]
[null,null,null,null,null,null,null,null,"-770,110",null,6,39,null,""]
[null,null,null,null,null,null,null,null,"-770,90",null,5,39,null,""]
[null,null,null,null,null,null,null,null,"-770,70",null,4,39,null,""]
[null,null,null,null,null,null,null,null,"-770,50",null,{"$f":"1+(RIGHT(I1233,LEN(I1233)-FIND(\",\",I1233))-10)/20","v":3},{"$f":"1+((LEFT(I1233,FIND(\",\",I1233)-1)*-1)-10)/20","v":39},null,{"$f":"IF(AND(K1233<=$I$140,K1233>=$I$141,L1233>=$M$139,L1233<=$N$139),MIN(ROUND(M1233,2),633),\"\")","v":""}]
[null,null,null,null,null,null,null,null,"-770,30",null,2,39,null,""]
[null,null,null,null,null,null,null,null,"-770,10",null,1,39,null,""]
[null,null,null,null,null,null,null,null,"-790,550",null,28,40,null,""]
[null,null,null,null,null,null,null,null,"-790,530",null,27,40,null,""]
[null,null,null,null,null,null,null,null,"-790,510",null,26,40,null,""]
[null,null,null,null,null,null,null,null,"-790,490",null,25,40,null,""]
[null,null,null,null,null,null,null,null,"-790,470",null,24,40,null,""]
[null,null,null,null,null,null,null,null,"-790,450",null,23,40,null,""]
[null,null,null,null,null,null,null,null,"-790,430",null,22,40,null,""]
[null,null,null,null,null,null,null,null,"-790,410",null,21,40,null,""]
[null,null,null,null,null,null,null,null,"-790,390",null,20,40,null,""]
[null,null,null,null,null,null,null,null,"-790,370",null,19,40,null,""]
[null,null,null,null,null,null,null,null,"-790,350",null,18,40,null,""]
[null,null,null,null,null,null,null,null,"-790,330",null,17,40,null,""]
[null,null,null,null,null,null,null,null,"-790,310",null,16,40,null,""]
[null,null,null,null,null,null,null,null,"-790,290",null,15,40,null,""]
[null,null,null,null,null,null,null,null,"-790,270",null,14,40,null,""]
[null,null,null,null,null,null,null,null,"-790,250",null,13,40,null,""]
[null,null,null,null,null,null,null,null,"-790,230",null,12,40,null,""]
[null,null,null,null,null,null,null,null,"-790,210",null,11,40,null,""]
[null,null,null,null,null,null,null,null,"-790,190",null,10,40,null,""]
[null,null,null,null,null,null,null,null,"-790,170",null,9,40,null,""]
[null,null,null,null,null,null,null,null,"-790,150",null,8,40,null,""]
[null,null,null,null,null,null,null,null,"-790,130",null,7,40,null,""]
[null,null,null,null,null,null,null,null,"-790,110",null,6,40,null,""]
[null,null,null,null,null,null,null,null,"-790,90",null,5,40,null,""]
[null,null,null,null,null,null,null,null,"-790,70",null,4,40,null,""]
[null,null,null,null,null,null,null,null,"-790,50",null,3,40,null,""]
[null,null,null,null,null,null,null,null,"-790,30",null,2,40,null,""]
[null,null,null,null,null,null,null,null,"-790,10",null,1,40,null,""]
[null,null,null,null,null,null,null,null,"-810,550",null,28,41,null,""]
[null,null,null,null,null,null,null,null,"-810,530",null,27,41,null,""]
[null,null,null,null,null,null,null,null,"-810,510",null,26,41,null,""]
[null,null,null,null,null,null,null,null,"-810,490",null,25,41,null,""]
[null,null,null,null,null,null,null,null,"-810,470",null,24,41,null,""]
[null,null,null,null,null,null,null,null,"-810,450",null,23,41,null,""]
[null,null,null,null,null,null,null,null,"-810,430",null,22,41,null,""]
[null,null,null,null,null,null,null,null,"-810,410",null,21,41,null,""]
[null,null,null,null,null,null,null,null,"-810,390",null,20,41,null,""]
[null,null,null,null,null,null,null,null,"-810,370",null,19,41,null,""]
[null,null,null,null,null,null,null,null,"-810,350",null,18,41,null,""]
[null,null,null,null,null,null,null,null,"-810,330",null,17,41,null,""]
[null,null,null,null,null,null,null,null,"-810,310",null,16,41,null,""]
[null,null,null,null,null,null,null,null,"-810,290",null,15,41,null,""]
[null,null,null,null,null,null,null,null,"-810,270",null,14,41,null,""]
[null,null,null,null,null,null,null,null,"-810,250",null,13,41,null,""]
[null,null,null,null,null,null,null,null,"-810,230",null,12,41,null,""]
[null,null,null,null,null,null,null,null,"-810,210",null,11,41,null,""]
[null,null,null,null,null,null,null,null,"-810,190",null,10,41,null,""]
[null,null,null,null,null,null,null,null,"-810,170",null,9,41,null,""]
[null,null,null,null,null,null,null,null,"-810,150",null,8,41,null,""]
[null,null,null,null,null,null,null,null,"-810,130",null,7,41,null,""]
[null,null,null,null,null,null,null,null,"-810,110",null,6,41,null,""]
[null,null,null,null,null,null,null,null,"-810,90",null,5,41,null,""]
[null,null,null,null,null,null,null,null,"-810,70",null,4,41,null,""]
[null,null,null,null,null,null,null,null,"-810,50",null,3,41,null,""]
[null,null,null,null,null,null,null,null,"-810,30",null,2,41,null,""]
[null,null,null,null,null,null,null,null,"-810,10",null,1,41,null,""]
[null,null,null,null,null,null,null,null,"-830,550",null,28,42,null,""]
[null,null,null,null,null,null,null,null,"-830,530",null,27,42,null,""]
[null,null,null,null,null,null,null,null,"-830,510",null,26,42,null,""]
[null,null,null,null,null,null,null,null,"-830,490",null,25,42,null,""]
[null,null,null,null,null,null,null,null,"-830,470",null,24,42,null,""]
[null,null,null,null,null,null,null,null,"-830,450",null,{"$f":"1+(RIGHT(I1297,LEN(I1297)-FIND(\",\",I1297))-10)/20","v":23},{"$f":"1+((LEFT(I1297,FIND(\",\",I1297)-1)*-1)-10)/20","v":42},null,{"$f":"IF(AND(K1297<=$I$140,K1297>=$I$141,L1297>=$M$139,L1297<=$N$139),MIN(ROUND(M1297,2),633),\"\")","v":""}]
[null,null,null,null,null,null,null,null,"-830,430",null,22,42,null,""]
[null,null,null,null,null,null,null,null,"-830,410",null,21,42,null,""]
[null,null,null,null,null,null,null,null,"-830,390",null,20,42,null,""]
[null,null,null,null,null,null,null,null,"-830,370",null,19,42,null,""]
[null,null,null,null,null,null,null,null,"-830,350",null,18,42,null,""]
[null,null,null,null,null,null,null,null,"-830,330",null,17,42,null,""]
[null,null,null,null,null,null,null,null,"-830,310",null,16,42,null,""]
[null,null,null,null,null,null,null,null,"-830,290",null,15,42,null,""]
[null,null,null,null,null,null,null,null,"-830,270",null,14,42,null,""]
[null,null,null,null,null,null,null,null,"-830,250",null,13,42,null,""]
[null,null,null,null,null,null,null,null,"-830,230",null,12,42,null,""]
[null,null,null,null,null,null,null,null,"-830,210",null,11,42,null,""]
[null,null,null,null,null,null,null,null,"-830,190",null,10,42,null,""]
[null,null,null,null,null,null,null,null,"-830,170",null,9,42,null,""]
[null,null,null,null,null,null,null,null,"-830,150",null,8,42,null,""]
[null,null,null,null,null,null,null,null,"-830,130",null,7,42,null,""]
[null,null,null,null,null,null,null,null,"-830,110",null,6,42,null,""]
[null,null,null,null,null,null,null,null,"-830,90",null,5,42,null,""]
[null,null,null,null,null,null,null,null,"-830,70",null,4,42,null,""]
[null,null,null,null,null,null,null,null,"-830,50",null,3,42,null,""]
[null,null,null,null,null,null,null,null,"-830,30",null,2,42,null,""]
[null,null,null,null,null,null,null,null,"-830,10",null,1,42,null,""]
[null,null,null,null,null,null,null,null,"-850,550",null,28,43,null,""]
[null,null,null,null,null,null,null,null,"-850,530",null,27,43,null,""]
[null,null,null,null,null,null,null,null,"-850,510",null,26,43,null,""]
[null,null,null,null,null,null,null,null,"-850,490",null,25,43,null,""]
[null,null,null,null,null,null,null,null,"-850,470",null,24,43,null,""]
[null,null,null,null,null,null,null,null,"-850,450",null,23,43,null,""]
[null,null,null,null,null,null,null,null,"-850,430",null,22,43,null,""]
[null,null,null,null,null,null,null,null,"-850,410",null,21,43,null,""]
[null,null,null,null,null,null,null,null,"-850,390",null,20,43,null,""]
[null,null,null,null,null,null,null,null,"-850,370",null,19,43,null,""]
[null,null,null,null,null,null,null,null,"-850,350",null,18,43,null,""]
[null,null,null,null,null,null,null,null,"-850,330",null,17,43,null,""]
[null,null,null,null,null,null,null,null,"-850,310",null,16,43,null,""]
[null,null,null,null,null,null,null,null,"-850,290",null,15,43,null,""]
[null,null,null,null,null,null,null,null,"-850,270",null,14,43,null,""]
[null,null,null,null,null,null,null,null,"-850,250",null,13,43,null,""]
[null,null,null,null,null,null,null,null,"-850,230",null,12,43,null,""]
[null,null,null,null,null,null,null,null,"-850,210",null,11,43,null,""]
[null,null,null,null,null,null,null,null,"-850,190",null,10,43,null,""]
[null,null,null,null,null,null,null,null,"-850,170",null,9,43,null,""]
[null,null,null,null,null,null,null,null,"-850,150",null,8,43,null,""]
[null,null,null,null,null,null,null,null,"-850,130",null,7,43,null,""]
[null,null,null,null,null,null,null,null,"-850,110",null,6,43,null,""]
[null,null,null,null,null,null,null,null,"-850,90",null,5,43,null,""]
[null,null,null,null,null,null,null,null,"-850,70",null,4,43,null,""]
[null,null,null,null,null,null,null,null,"-850,50",null,3,43,null,""]
[null,null,null,null,null,null,null,null,"-850,30",null,2,43,null,""]
[null,null,null,null,null,null,null,null,"-850,10",null,1,43,null,""]
[null,null,null,null,null,null,null,null,"-870,550",null,28,44,null,""]
[null,null,null,null,null,null,null,null,"-870,530",null,27,44,null,""]
[null,null,null,null,null,null,null,null,"-870,510",null,26,44,null,""]
[null,null,null,null,null,null,null,null,"-870,490",null,25,44,null,""]
[null,null,null,null,null,null,null,null,"-870,470",null,24,44,null,""]
[null,null,null,null,null,null,null,null,"-870,450",null,23,44,null,""]
[null,null,null,null,null,null,null,null,"-870,430",null,22,44,null,""]
[null,null,null,null,null,null,null,null,"-870,410",null,21,44,null,""]
[null,null,null,null,null,null,null,null,"-870,390",null,20,44,null,""]
[null,null,null,null,null,null,null,null,"-870,370",null,19,44,null,""]
[null,null,null,null,null,null,null,null,"-870,350",null,18,44,null,""]
[null,null,null,null,null,null,null,null,"-870,330",null,17,44,null,""]
[null,null,null,null,null,null,null,null,"-870,310",null,16,44,null,""]
[null,null,null,null,null,null,null,null,"-870,290",null,{"$f":"1+(RIGHT(I1361,LEN(I1361)-FIND(\",\",I1361))-10)/20","v":15},{"$f":"1+((LEFT(I1361,FIND(\",\",I1361)-1)*-1)-10)/20","v":44},null,{"$f":"IF(AND(K1361<=$I$140,K1361>=$I$141,L1361>=$M$139,L1361<=$N$139),MIN(ROUND(M1361,2),633),\"\")","v":""}]
[null,null,null,null,null,null,null,null,"-870,270",null,14,44,null,""]
[null,null,null,null,null,null,null,null,"-870,250",null,13,44,null,""]
[null,null,null,null,null,null,null,null,"-870,230",null,12,44,null,""]
[null,null,null,null,null,null,null,null,"-870,210",null,11,44,null,""]
[null,null,null,null,null,null,null,null,"-870,190",null,10,44,null,""]
[null,null,null,null,null,null,null,null,"-870,170",null,9,44,null,""]
[null,null,null,null,null,null,null,null,"-870,150",null,8,44,null,""]
[null,null,null,null,null,null,null,null,"-870,130",null,7,44,null,""]
[null,null,null,null,null,null,null,null,"-870,110",null,6,44,null,""]
[null,null,null,null,null,null,null,null,"-870,90",null,5,44,null,""]
[null,null,null,null,null,null,null,null,"-870,70",null,4,44,null,""]
[null,null,null,null,null,null,null,null,"-870,50",null,3,44,null,""]
[null,null,null,null,null,null,null,null,"-870,30",null,2,44,null,""]
[null,null,null,null,null,null,null,null,"-870,10",null,1,44,null,""]
[null,null,null,null,null,null,null,null,"-890,550",null,28,45,null,""]
[null,null,null,null,null,null,null,null,"-890,530",null,27,45,null,""]
[null,null,null,null,null,null,null,null,"-890,510",null,26,45,null,""]
[null,null,null,null,null,null,null,null,"-890,490",null,25,45,null,""]
[null,null,null,null,null,null,null,null,"-890,470",null,24,45,null,""]
[null,null,null,null,null,null,null,null,"-890,450",null,23,45,null,""]
[null,null,null,null,null,null,null,null,"-890,430",null,22,45,null,""]
[null,null,null,null,null,null,null,null,"-890,410",null,21,45,null,""]
[null,null,null,null,null,null,null,null,"-890,390",null,20,45,null,""]
[null,null,null,null,null,null,null,null,"-890,370",null,19,45,null,""]
[null,null,null,null,null,null,null,null,"-890,350",null,18,45,null,""]
[null,null,null,null,null,null,null,null,"-890,330",null,17,45,null,""]
[null,null,null,null,null,null,null,null,"-890,310",null,16,45,null,""]
[null,null,null,null,null,null,null,null,"-890,290",null,15,45,null,""]
[null,null,null,null,null,null,null,null,"-890,270",null,14,45,null,""]
[null,null,null,null,null,null,null,null,"-890,250",null,13,45,null,""]
[null,null,null,null,null,null,null,null,"-890,230",null,12,45,null,""]
[null,null,null,null,null,null,null,null,"-890,210",null,11,45,null,""]
[null,null,null,null,null,null,null,null,"-890,190",null,10,45,null,""]
[null,null,null,null,null,null,null,null,"-890,170",null,9,45,null,""]
[null,null,null,null,null,null,null,null,"-890,150",null,8,45,null,""]
[null,null,null,null,null,null,null,null,"-890,130",null,7,45,null,""]
[null,null,null,null,null,null,null,null,"-890,110",null,6,45,null,""]
[null,null,null,null,null,null,null,null,"-890,90",null,5,45,null,""]
[null,null,null,null,null,null,null,null,"-890,70",null,4,45,null,""]
[null,null,null,null,null,null,null,null,"-890,50",null,3,45,null,""]
[null,null,null,null,null,null,null,null,"-890,30",null,2,45,null,""]
[null,null,null,null,null,null,null,null,"-890,10",null,1,45,null,""]
[null,null,null,null,null,null,null,null,"-910,550",null,28,46,null,""]
[null,null,null,null,null,null,null,null,"-910,530",null,27,46,null,""]
[null,null,null,null,null,null,null,null,"-910,510",null,26,46,null,""]
[null,null,null,null,null,null,null,null,"-910,490",null,25,46,null,""]
[null,null,null,null,null,null,null,null,"-910,470",null,24,46,null,""]
[null,null,null,null,null,null,null,null,"-910,450",null,23,46,null,""]
[null,null,null,null,null,null,null,null,"-910,430",null,22,46,null,""]
[null,null,null,null,null,null,null,null,"-910,410",null,21,46,null,""]
[null,null,null,null,null,null,null,null,"-910,390",null,20,46,null,""]
[null,null,null,null,null,null,null,null,"-910,370",null,19,46,null,""]
[null,null,null,null,null,null,null,null,"-910,350",null,18,46,null,""]
[null,null,null,null,null,null,null,null,"-910,330",null,17,46,null,""]
[null,null,null,null,null,null,null,null,"-910,310",null,16,46,null,""]
[null,null,null,null,null,null,null,null,"-910,290",null,15,46,null,""]
[null,null,null,null,null,null,null,null,"-910,270",null,14,46,null,""]
[null,null,null,null,null,null,null,null,"-910,250",null,13,46,null,""]
[null,null,null,null,null,null,null,null,"-910,230",null,12,46,null,""]
[null,null,null,null,null,null,null,null,"-910,210",null,11,46,null,""]
[null,null,null,null,null,null,null,null,"-910,190",null,10,46,null,""]
[null,null,null,null,null,null,null,null,"-910,170",null,9,46,null,""]
[null,null,null,null,null,null,null,null,"-910,150",null,8,46,null,""]
[null,null,null,null,null,null,null,null,"-910,130",null,{"$f":"1+(RIGHT(I1425,LEN(I1425)-FIND(\",\",I1425))-10)/20","v":7},{"$f":"1+((LEFT(I1425,FIND(\",\",I1425)-1)*-1)-10)/20","v":46},null,{"$f":"IF(AND(K1425<=$I$140,K1425>=$I$141,L1425>=$M$139,L1425<=$N$139),MIN(ROUND(M1425,2),633),\"\")","v":""}]
[null,null,null,null,null,null,null,null,"-910,110",null,6,46,null,""]
[null,null,null,null,null,null,null,null,"-910,90",null,5,46,null,""]
[null,null,null,null,null,null,null,null,"-910,70",null,4,46,null,""]
[null,null,null,null,null,null,null,null,"-910,50",null,3,46,null,""]
[null,null,null,null,null,null,null,null,"-910,30",null,2,46,null,""]
[null,null,null,null,null,null,null,null,"-910,10",null,1,46,null,""]
[null,null,null,null,null,null,null,null,"-930,550",null,28,47,null,""]
[null,null,null,null,null,null,null,null,"-930,530",null,27,47,null,""]
[null,null,null,null,null,null,null,null,"-930,510",null,26,47,null,""]
[null,null,null,null,null,null,null,null,"-930,490",null,25,47,null,""]
[null,null,null,null,null,null,null,null,"-930,470",null,24,47,null,""]
[null,null,null,null,null,null,null,null,"-930,450",null,23,47,null,""]
[null,null,null,null,null,null,null,null,"-930,430",null,22,47,null,""]
[null,null,null,null,null,null,null,null,"-930,410",null,21,47,null,""]
[null,null,null,null,null,null,null,null,"-930,390",null,20,47,null,""]
[null,null,null,null,null,null,null,null,"-930,370",null,19,47,null,""]
[null,null,null,null,null,null,null,null,"-930,350",null,18,47,null,""]
[null,null,null,null,null,null,null,null,"-930,330",null,17,47,null,""]
[null,null,null,null,null,null,null,null,"-930,310",null,16,47,null,""]
[null,null,null,null,null,null,null,null,"-930,290",null,15,47,null,""]
[null,null,null,null,null,null,null,null,"-930,270",null,14,47,null,""]
[null,null,null,null,null,null,null,null,"-930,250",null,13,47,null,""]
[null,null,null,null,null,null,null,null,"-930,230",null,12,47,null,""]
[null,null,null,null,null,null,null,null,"-930,210",null,11,47,null,""]
[null,null,null,null,null,null,null,null,"-930,190",null,10,47,null,""]
[null,null,null,null,null,null,null,null,"-930,170",null,9,47,null,""]
[null,null,null,null,null,null,null,null,"-930,150",null,8,47,null,""]
[null,null,null,null,null,null,null,null,"-930,130",null,7,47,null,""]
[null,null,null,null,null,null,null,null,"-930,110",null,6,47,null,""]
[null,null,null,null,null,null,null,null,"-930,90",null,5,47,null,""]
[null,null,null,null,null,null,null,null,"-930,70",null,4,47,null,""]
[null,null,null,null,null,null,null,null,"-930,50",null,3,47,null,""]
[null,null,null,null,null,null,null,null,"-930,30",null,2,47,null,""]
[null,null,null,null,null,null,null,null,"-930,10",null,1,47,null,""]
[null,null,null,null,null,null,null,null,"-950,550",null,28,48,null,""]
[null,null,null,null,null,null,null,null,"-950,530",null,27,48,null,""]
[null,null,null,null,null,null,null,null,"-950,510",null,26,48,null,""]
[null,null,null,null,null,null,null,null,"-950,490",null,25,48,null,""]
[null,null,null,null,null,null,null,null,"-950,470",null,24,48,null,""]
[null,null,null,null,null,null,null,null,"-950,450",null,23,48,null,""]
[null,null,null,null,null,null,null,null,"-950,430",null,22,48,null,""]
[null,null,null,null,null,null,null,null,"-950,410",null,21,48,null,""]
[null,null,null,null,null,null,null,null,"-950,390",null,20,48,null,""]
[null,null,null,null,null,null,null,null,"-950,370",null,19,48,null,""]
[null,null,null,null,null,null,null,null,"-950,350",null,18,48,null,""]
[null,null,null,null,null,null,null,null,"-950,330",null,17,48,null,""]
[null,null,null,null,null,null,null,null,"-950,310",null,16,48,null,""]
[null,null,null,null,null,null,null,null,"-950,290",null,15,48,null,""]
[null,null,null,null,null,null,null,null,"-950,270",null,14,48,null,""]
[null,null,null,null,null,null,null,null,"-950,250",null,13,48,null,""]
[null,null,null,null,null,null,null,null,"-950,230",null,12,48,null,""]
[null,null,null,null,null,null,null,null,"-950,210",null,11,48,null,""]
[null,null,null,null,null,null,null,null,"-950,190",null,10,48,null,""]
[null,null,null,null,null,null,null,null,"-950,170",null,9,48,null,""]
[null,null,null,null,null,null,null,null,"-950,150",null,8,48,null,""]
[null,null,null,null,null,null,null,null,"-950,130",null,7,48,null,""]
[null,null,null,null,null,null,null,null,"-950,110",null,6,48,null,""]
[null,null,null,null,null,null,null,null,"-950,90",null,5,48,null,""]
[null,null,null,null,null,null,null,null,"-950,70",null,4,48,null,""]
[null,null,null,null,null,null,null,null,"-950,50",null,3,48,null,""]
[null,null,null,null,null,null,null,null,"-950,30",null,2,48,null,""]
[null,null,null,null,null,null,null,null,"-950,10",null,1,48,null,""]
[null,null,null,null,null,null,null,null,"-970,550",null,28,49,null,""]
[null,null,null,null,null,null,null,null,"-970,530",null,{"$f":"1+(RIGHT(I1489,LEN(I1489)-FIND(\",\",I1489))-10)/20","v":27},{"$f":"1+((LEFT(I1489,FIND(\",\",I1489)-1)*-1)-10)/20","v":49},null,{"$f":"IF(AND(K1489<=$I$140,K1489>=$I$141,L1489>=$M$139,L1489<=$N$139),MIN(ROUND(M1489,2),633),\"\")","v":""}]
[null,null,null,null,null,null,null,null,"-970,510",null,26,49,null,""]
[null,null,null,null,null,null,null,null,"-970,490",null,25,49,null,""]
[null,null,null,null,null,null,null,null,"-970,470",null,24,49,null,""]
[null,null,null,null,null,null,null,null,"-970,450",null,23,49,null,""]
[null,null,null,null,null,null,null,null,"-970,430",null,22,49,null,""]
[null,null,null,null,null,null,null,null,"-970,410",null,21,49,null,""]
[null,null,null,null,null,null,null,null,"-970,390",null,20,49,null,""]
[null,null,null,null,null,null,null,null,"-970,370",null,19,49,null,""]
[null,null,null,null,null,null,null,null,"-970,350",null,18,49,null,""]
[null,null,null,null,null,null,null,null,"-970,330",null,17,49,null,""]
[null,null,null,null,null,null,null,null,"-970,310",null,16,49,null,""]
[null,null,null,null,null,null,null,null,"-970,290",null,15,49,null,""]
[null,null,null,null,null,null,null,null,"-970,270",null,14,49,null,""]
[null,null,null,null,null,null,null,null,"-970,250",null,13,49,null,""]
[null,null,null,null,null,null,null,null,"-970,230",null,12,49,null,""]
[null,null,null,null,null,null,null,null,"-970,210",null,11,49,null,""]
[null,null,null,null,null,null,null,null,"-970,190",null,10,49,null,""]
[null,null,null,null,null,null,null,null,"-970,170",null,9,49,null,""]
[null,null,null,null,null,null,null,null,"-970,150",null,8,49,null,""]
[null,null,null,null,null,null,null,null,"-970,130",null,7,49,null,""]
[null,null,null,null,null,null,null,null,"-970,110",null,6,49,null,""]
[null,null,null,null,null,null,null,null,"-970,90",null,5,49,null,""]
[null,null,null,null,null,null,null,null,"-970,70",null,4,49,null,""]
[null,null,null,null,null,null,null,null,"-970,50",null,3,49,null,""]
[null,null,null,null,null,null,null,null,"-970,30",null,2,49,null,""]
[null,null,null,null,null,null,null,null,"-970,10",null,1,49,null,""]
[null,null,null,null,null,null,null,null,"-990,550",null,28,50,null,""]
[null,null,null,null,null,null,null,null,"-990,530",null,27,50,null,""]
[null,null,null,null,null,null,null,null,"-990,510",null,26,50,null,""]
[null,null,null,null,null,null,null,null,"-990,490",null,25,50,null,""]
[null,null,null,null,null,null,null,null,"-990,470",null,24,50,null,""]
[null,null,null,null,null,null,null,null,"-990,450",null,23,50,null,""]
[null,null,null,null,null,null,null,null,"-990,430",null,22,50,null,""]
[null,null,null,null,null,null,null,null,"-990,410",null,21,50,null,""]
[null,null,null,null,null,null,null,null,"-990,390",null,20,50,null,""]
[null,null,null,null,null,null,null,null,"-990,370",null,19,50,null,""]
[null,null,null,null,null,null,null,null,"-990,350",null,18,50,null,""]
[null,null,null,null,null,null,null,null,"-990,330",null,17,50,null,""]
[null,null,null,null,null,null,null,null,"-990,310",null,16,50,null,""]
[null,null,null,null,null,null,null,null,"-990,290",null,15,50,null,""]
[null,null,null,null,null,null,null,null,"-990,270",null,14,50,null,""]
[null,null,null,null,null,null,null,null,"-990,250",null,13,50,null,""]
[null,null,null,null,null,null,null,null,"-990,230",null,12,50,null,""]
[null,null,null,null,null,null,null,null,"-990,210",null,11,50,null,""]
[null,null,null,null,null,null,null,null,"-990,190",null,10,50,null,""]
[null,null,null,null,null,null,null,null,"-990,170",null,9,50,null,""]
[null,null,null,null,null,null,null,null,"-990,150",null,8,50,null,""]
[null,null,null,null,null,null,null,null,"-990,130",null,7,50,null,""]
[null,null,null,null,null,null,null,null,"-990,110",null,6,50,null,""]
[null,null,null,null,null,null,null,null,"-990,90",null,5,50,null,""]
[null,null,null,null,null,null,null,null,"-990,70",null,4,50,null,""]
[null,null,null,null,null,null,null,null,"-990,50",null,3,50,null,""]
[null,null,null,null,null,null,null,null,"-990,30",null,2,50,null,""]
[null,null,null,null,null,null,null,null,"-990,10",null,1,50,null,""]

{"sheet":"AOP Frontal FW","index":3,"n_rows":207,"n_cols":9,"rows_kept":207,"cut":false,"hidden":false,"merged":[[53,1,53,2],[58,1,58,2],[58,3,58,4],[58,5,58,6],[55,5,55,6],[56,5,56,6],[57,5,57,6],[57,3,57,4],[57,7,57,8],[19,1,19,2],[19,3,19,4],[19,7,19,8],[198,1,198,4],[68,1,68,8],[56,3,56,4],[56,7,56,8],[62,1,62,2],[62,3,62,8],[60,1,60,2],[60,3,60,8],[19,5,19,6],[20,5,20,6],[183,1,183,4],[40,1,40,2],[42,7,42,8],[1,1,2,2],[1,3,2,4],[1,7,2,8],[3,1,3,2],[14,3,14,4],[14,7,14,8],[13,1,13,2],[13,3,13,4],[13,7,13,8],[1,5,2,6],[13,5,13,6],[14,5,14,6],[42,1,42,2],[37,1,37,2],[33,1,33,2],[58,7,58,8],[20,7,20,8],[20,3,20,4],[28,3,28,4],[55,3,55,4],[55,7,55,8],[54,3,54,4],[54,7,54,8],[54,5,54,6],[27,7,27,8],[27,3,27,4],[27,5,27,6],[28,7,28,8],[28,5,28,6],[42,5,42,6],[42,3,42,4]]}
[]
[null,"Frontal FW Test",null,"Driver",null,"Front Passenger",null,"Rear Passenger"]
[]
[null,{"$f":"'General Overview'!G5","v":""},null,"Value","Points","Value","Points","Value","Points"]
[null,"HEAD"]
[null,null,"Steering wheel airbag present? ",null,null,null,null,"Contact?","No"]
[null,null,"Peak resultant acceleration - g",null,{"$f":"IF(D6=\"Yes\",IF(D7<80,4,\"\"),0)","v":0},null,{"$f":"IF(F7=\"\",0,IF(F7<80,4,\"\"))","v":0},null,{"$f":"IF(I6=\"Yes\",IF(H7<80,4,\"\"),\"\")","v":""}]
[null,null,"HIC15",null,{"$f":"IF(D6=\"Yes\",IF(D7<80,\"\",ROUND(Sliding_Scale(D8,500,700,4,0),Round)),\"\")","v":""},null,{"$f":"IF(F7<80,\"\",ROUND(Sliding_Scale(F8,500,700,4,0),Round))","v":""},null,{"$f":"IF(I6=\"Yes\",IF(H7<80,\"\",ROUND(Sliding_Scale(H8,500,700,4,0),Round)),\"\")","v":""}]
[null,null,"Resultant Acc. 3 msec exeedence - g",null,{"$f":"IF(D6=\"Yes\",IF(D7<80,\"\",ROUND(Sliding_Scale(D9,72,80,4,0),Round)),\"\")","v":""},null,{"$f":"IF(F7<80,\"\",ROUND(Sliding_Scale(F9,72,80,4,0),Round))","v":""},null,{"$f":"IF(I6=\"No\",ROUND(Sliding_Scale(H9,72,80,4,0),Round),\"\")","v":{"$error":"#NAME?"}}]
[null,null,"Airbag contact modifier (-1)",null,{"$f":"D10","v":0},null,{"$f":"F10","v":0},null,{"$f":"H10","v":0}]
[null,null,"Hazardous airbag deployment modifier (-1)",null,{"$f":"D11","v":0},null,{"$f":"F11","v":0},null,{"$f":"H11","v":0}]
[null,null,"Incorrect airbag deployment modifier (-1)",null,{"$f":"D12","v":0},null,{"$f":"F12","v":0},null,{"$f":"H12","v":0}]
[null,null,"Head Excursion (-2/-4)",null,null,null,null,null,{"$f":"H13","v":0}]
[null,"Head Assessment",null,{"$f":"MAX(IF(D6=\"Yes\",MIN(E7:E9)+SUM(E10:E12),0))","v":0},null,{"$f":"MAX(MIN(G7:G9)+SUM(G10:G12),0)","v":0},null,{"$f":"MAX(MIN(I7:I9)+SUM(I10:I13),0)","v":{"$error":"#NAME?"}}]
[]
[null,"NECK"]
[null,null,"Shear level exceeded - kN",null,{"$f":"ROUND(Sliding_Scale(D17,1.2,1.95,4,0),Round)","v":{"$error":"#NAME?"}},null,{"$f":"ROUND(Sliding_Scale(F17,1.2,1.95,4,0),Round)","v":{"$error":"#NAME?"}},null,{"$f":"ROUND(Sliding_Scale(H17,1.2,1.95,1,0),Round)","v":{"$error":"#NAME?"}}]
[null,null,"Tension level exceeded - kN",null,{"$f":"ROUND(Sliding_Scale(D18,1.7,2.62,4,0),Round)","v":{"$error":"#NAME?"}},null,{"$f":"ROUND(Sliding_Scale(F18,1.7,2.62,4,0),Round)","v":{"$error":"#NAME?"}},null,{"$f":"ROUND(Sliding_Scale(H18,1.7,2.62,1,0),Round)","v":{"$error":"#NAME?"}}]
[null,null,"Extension - Nm",null,{"$f":"ROUND(Sliding_Scale(D19,36,49,4,0),Round)","v":{"$error":"#NAME?"}},null,{"$f":"ROUND(Sliding_Scale(F19,36,49,4,0),Round)","v":{"$error":"#NAME?"}},null,{"$f":"ROUND(Sliding_Scale(H19,36,49,2,0),Round)","v":{"$error":"#NAME?"}}]
[null,"Neck assessment",null,{"$f":"IF(D6=\"Yes\",MIN(E17:E19),0)","v":0},null,{"$f":"MIN(G17:G19)","v":{"$error":"#NAME?"}},null,{"$f":"SUM(I17:I19)","v":{"$error":"#NAME?"}}]
[]
[null,"CHEST"]
[null,null,"Compression - mm",null,{"$f":"ROUND(Sliding_Scale(D23,18,42,4,0),Round)","v":{"$error":"#NAME?"}},null,{"$f":"ROUND(Sliding_Scale(F23,18,42,4,0),Round)","v":{"$error":"#NAME?"}},null,{"$f":"ROUND(Sliding_Scale(H23,18,42,4,0),Round)","v":{"$error":"#NAME?"}}]
[null,null,"Viscous criterion - m/s",null,{"$f":"ROUND(Sliding_Scale(D24,0.5,1,4,0),Round)","v":{"$error":"#NAME?"}},null,{"$f":"ROUND(Sliding_Scale(F24,0.5,1,4,0),Round)","v":{"$error":"#NAME?"}},null,{"$f":"ROUND(Sliding_Scale(H24,0.5,1,4,0),Round)","v":{"$error":"#NAME?"}}]
[null,null,"Shoulder belt load - kN (-2)",null,{"$f":"IF(D25>6,-2,0)","v":0},null,{"$f":"IF(F25>6,-2,0)","v":0},null,{"$f":"IF(H25>6,-2,0)","v":0}]
[null,null,"Incorrect airbag deployment modifier (-1)",null,{"$f":"D26","v":0},null,null,null,{"$f":"H26","v":0}]
[null,null,"Steering wheel contact (-1) ",null,{"$f":"D27","v":0}]
[null,"Chest assessment",null,{"$f":"MAX(MIN(E23:E24)+E25,0)","v":{"$error":"#NAME?"}},null,{"$f":"MAX(MIN(G23:G24)+G25,0)","v":{"$error":"#NAME?"}},null,{"$f":"MAX(MIN(I23:I24)+I25+I26,0)","v":{"$error":"#NAME?"}}]
[]
[null,"KNEE, FEMUR and PELVIS"]
[null,null,"Left Knee Slide - mm"]
[null,null,"Left Femur Compression level exceeded - kN",null,{"$f":"ROUND(Sliding_Scale(D32,2.6,6.2,4,0),Round)","v":{"$error":"#NAME?"}},null,{"$f":"ROUND(Sliding_Scale(F32,2.6,6.2,4,0),Round)","v":{"$error":"#NAME?"}},null,{"$f":"ROUND(Sliding_Scale(H32,2.6,6.2,4,0),Round)","v":{"$error":"#NAME?"}}]
[null,null,"Incorrect airbag deployment modifier (-1)",null,{"$f":"D33","v":0},null,null,null,{"$f":"H33","v":0}]
[null,"Left Knee, Femur and Pelvis assessment",null,null,{"$f":"MAX(MIN(E32:E32)+E33,0)","v":{"$error":"#NAME?"}},null,{"$f":"MAX(MIN(G31:G32),0)","v":{"$error":"#NAME?"}},null,{"$f":"MAX(MIN(I32:I32)+I33,0)","v":{"$error":"#NAME?"}}]
[null,null,"Right Knee Slide - mm"]
[null,null,"Right Femur Compression level exceeded - kN",null,{"$f":"ROUND(Sliding_Scale(D36,2.6,6.2,4,0),Round)","v":{"$error":"#NAME?"}},null,{"$f":"ROUND(Sliding_Scale(F36,2.6,6.2,4,0),Round)","v":{"$error":"#NAME?"}},null,{"$f":"ROUND(Sliding_Scale(H36,2.6,6.02,4,0),Round)","v":{"$error":"#NAME?"}}]
[null,null,"Incorrect airbag deployment modifier (-1)",null,{"$f":"D37","v":0},null,null,null,{"$f":"H37","v":0}]
[null,"Right Knee, Femur and Pelvis assessment",null,null,{"$f":"MAX(MIN(E36:E36)+E37,0)","v":{"$error":"#NAME?"}},null,{"$f":"MAX(MIN(G35:G36),0)","v":{"$error":"#NAME?"}},null,{"$f":"MAX(MIN(I36:I36)+I37,0)","v":{"$error":"#NAME?"}}]
[]
[null,null,"Iliac load drop 1ms - kN",null,{"$f":"IF(D40>=1,-4,0)","v":0},null,{"$f":"IF(F40>=1,-4,0)","v":0},null,{"$f":"IF(H40>=1,-4,0)","v":0}]
[null,"Pelvis assessment",null,{"$f":"IF(E41=0,\"Green\",IF(E41=-4,\"Red\"))","v":"Green"},{"$f":"E40","v":0},{"$f":"IF(G41=0,\"Green\",IF(G41=-4,\"Red\"))","v":"Green"},{"$f":"G40","v":0},{"$f":"IF(I41=0,\"Green\",IF(I41=-4,\"Red\"))","v":"Green"},{"$f":"I40","v":0}]
[]
[null,"Knee, Femur and Pelvis assessment",null,{"$f":"MAX(MIN(E34,E38)+E41,0)","v":{"$error":"#NAME?"}},null,{"$f":"MAX(MIN(G34,G38)+G41,0)","v":{"$error":"#NAME?"}},null,{"$f":"MAX(MIN(I34,I38)+I41,0)","v":{"$error":"#NAME?"}}]
[]
[null,"LOWER LEG"]
[null,null,"Left compression - kN"]
[null,null,"Left Upper Tibia Index "]
[null,null,"Left Lower Tibia Index"]
[]
[null,null,"Right compression - kN"]
[null,null,"Right Upper Tibia Index "]
[null,null,"Right Lower Tibia Index"]
[]
[null,"SUMMARY"]
[null,null,"Head assessment",{"$f":"D14","v":0},null,{"$f":"F14","v":0},null,{"$f":"H14","v":{"$error":"#NAME?"}}]
[null,null,"Neck assessment",{"$f":"D20","v":0},null,{"$f":"F20","v":{"$error":"#NAME?"}},null,{"$f":"H20","v":{"$error":"#NAME?"}}]
[null,null,"Chest assessment",{"$f":"D28","v":{"$error":"#NAME?"}},null,{"$f":"F28","v":{"$error":"#NAME?"}},null,{"$f":"H28","v":{"$error":"#NAME?"}}]
[null,null,"Knee, Femur and Pelvis assessment",{"$f":"D43","v":{"$error":"#NAME?"}},null,{"$f":"F43","v":{"$error":"#NAME?"}},null,{"$f":"H43","v":{"$error":"#NAME?"}}]
[null,"DUMMY SCORE",null,{"$f":"ROUND(SUM(D55:E58),Round)","v":{"$error":"#NAME?"}},null,{"$f":"ROUND(SUM(F55:G58),Round)","v":{"$error":"#NAME?"}},null,{"$f":"ROUND(SUM(H55:I58),Round)","v":{"$error":"#NAME?"}}]
[]
[null,"Door Opening",null,0]
[]
[null,"TOTAL FRONTAL FW",null,{"$f":"IF(OR(D7>=120,D8>=700,D9>=80,D17>=2.7,D18>=2.9,D19>=57,D23>=42,D24>=1,AND(I6=\"Yes\",H8>=700),H9>=80,H23>=42,H24>=1),0,ROUND(MAX(IF(F59<0.9*D59,(0.5*(MIN(D55:G55)+MIN(D56:G56)+MIN(D57:G57)+MIN(D58:G58))+H59)/4*IF('General Overview'!C17=0,2,1)+D61,(D59+H59)/4*IF('General Overview'!C17=0,2,1)+D61),0),Round))","v":{"$error":"#NAME?"}}]
[null,null,null,null,null,"INCLUDE LOGIC IF <90%"]
[]
[]
[]
[]
[null,"DUMMY MEASUREMENTS"]
[null,"Head"]
[null,"Ax","Max"]
[null,null,"Min"]
[null,"Ay","Max"]
[null,null,"Min"]
[null,"Az","Max"]
[null,null,"Min"]
[null,"Neck"]
[null,"Fx","Max"]
[null,null,"Min"]
[null,"Fy","Max"]
[null,null,"Min"]
[null,"Fz","Max"]
[null,null,"Min"]
[null,"Mx","Max"]
[null,null,"Min"]
[null,"My","Max"]
[null,null,"Min"]
[null,"Mz","Max"]
[null,null,"Min"]
[null,"Chest"]
[null,"Ax","Max"]
[null,null,"Min"]
[null,"Ay","Max"]
[null,null,"Min"]
[null,"Az","Max"]
[null,null,"Min"]
[null,"Dchest","Max"]
[null,null,"Min"]
[null,"Pelvis"]
[null,"Ax","Max"]
[null,null,"Min"]
[null,"Ay","Max"]
[null,null,"Min"]
[null,"Az","Max"]
[null,null,"Min"]
[null,"Iliac (left)"]
[null,"Fx","Max"]
[null,null,"Min"]
[null,"My","Max"]
[null,null,"Min"]
[null,"Iliac (right)"]
[null,"Fx","Max"]
[null,null,"Min"]
[null,"My","Max"]
[null,null,"Min"]
[null,"Lumbar Spine"]
[null,"Fx","Max"]
[null,null,"Min"]
[null,"Fz","Max"]
[null,null,"Min"]
[null,"My","Max"]
[null,null,"Min"]
[null,"Femur (left)"]
[null,"Fz","Max"]
[null,null,"Min"]
[null,"Femur (right)"]
[null,"Fz","Max"]
[null,null,"Min"]
[null,"Knee (left)"]
[null,"Dknee","Max"]
[null,null,"Min"]
[null,"Knee (right)"]
[null,"Dknee","Max"]
[null,null,"Min"]
[null,"Upper Tibia (left)"]
[null,"Fx","Max"]
[null,null,"Min"]
[null,"Fz","Max"]
[null,null,"Min"]
[null,"Mx","Max"]
[null,null,"Min"]
[null,"My","Max"]
[null,null,"Min"]
[null,"Upper Tibia (right)"]
[null,"Fx","Max"]
[null,null,"Min"]
[null,"Fz","Max"]
[null,null,"Min"]
[null,"Mx","Max"]
[null,null,"Min"]
[null,"My","Max"]
[null,null,"Min"]
[null,"Lower Tibia (left)"]
[null,"Fx","Max"]
[null,null,"Min"]
[null,"Fy","Max"]
[null,null,"Min"]
[null,"Fz","Max"]
[null,null,"Min"]
[null,"Mx","Max"]
[null,null,"Min"]
[null,"My","Max"]
[null,null,"Min"]
[null,"Lower Tibia (right)"]
[null,"Fx","Max"]
[null,null,"Min"]
[null,"Fy","Max"]
[null,null,"Min"]
[null,"Fz","Max"]
[null,null,"Min"]
[null,"Mx","Max"]
[null,null,"Min"]
[null,"My","Max"]
[null,null,"Min"]
[]
[null,"VEHICLE MEASUREMENTS"]
[null,"Vehicle B-post"]
[null,"Ax","Max"]
[null,null,"Min"]
[null,"Seatbelt"]
[null,"Fseatbelt","Max"]
[null,null,"Min"]
[]
[null,"STATIC MEASURMENTS"]
[null,"Steering wheel"]
[null,null,"Fore/aft displacement - mm",0,{"$f":"IF(D186>0,\"rearward\",IF(D186<0,\"forward\",\"\"))","v":""}]
[null,null,"Vertical displacement - mm",0,{"$f":"IF(D187>0,\"upward\",IF(D187<0,\"downward\",\"\"))","v":""}]
[null,null,"Lateral displacement - mm",0,{"$f":"IF(D188>0,\"left\",IF(D188<0,\"right\",\"\"))","v":""}]
[null,"A-pillar"]
[null,null,"A-Pillar displacement - mm",0]
[null,"Pedals"]
[null,null,"Brake Vertical displacement - mm",0,{"$f":"IF(D192=\"N/A\",\"\",IF(D192>0,\"upward\",IF(D192<0,\"downward\",\"\")))","v":""}]
[null,null,"Clutch Vertical displacement - mm",0,{"$f":"IF(D193=\"N/A\",\"\",IF(D193>0,\"upward\",IF(D193<0,\"downward\",\"\")))","v":""}]
[null,null,"Accel Vertical displacement - mm",0,{"$f":"IF(D194=\"N/A\",\"\",IF(D194>0,\"upward\",IF(D194<0,\"downward\",\"\")))","v":""}]
[null,null,"Brake Horizontal displacement - mm",0,{"$f":"IF(D195=\"N/A\",\"\",IF(D195>0,\"rearward\",IF(D195<0,\"forward\",\"\")))","v":""}]
[null,null,"Clutch Horizontal displacement - mm",0,{"$f":"IF(D196=\"N/A\",\"\",IF(D196>0,\"rearward\",IF(D196<0,\"forward\",\"\")))","v":""}]
[null,null,"Accel Horizontal displacement - mm",0,{"$f":"IF(D197=\"N/A\",\"\",IF(D197>0,\"rearward\",IF(D197<0,\"forward\",\"\")))","v":""}]
[]
[null,"TEST DETAILS"]
[null,"Vehicle"]
[null,null,"VIN number"]
[null,null,"Test weight - kg",0]
[null,"Test"]
[null,null,"Impact speed - km/h",0]
[null,null,"Impact location - mm"]
[null,null,"Vertical",0]
[null,null,"Horizontal",0]

{"sheet":"AOP Side MDB","index":4,"n_rows":158,"n_cols":5,"rows_kept":158,"cut":false,"hidden":false,"merged":[[149,1,149,4],[58,1,58,4],[46,3,46,4],[41,1,41,2],[41,3,41,4],[52,1,52,2],[52,3,52,4],[48,1,48,2],[48,3,48,4],[47,3,47,4],[50,1,50,2],[50,3,50,4],[45,3,45,4],[25,3,25,4],[43,1,43,2],[44,3,44,4],[26,3,26,4],[37,3,37,4],[42,3,42,4],[25,1,25,2],[31,1,31,2],[36,1,36,2],[36,3,36,4],[17,1,17,2],[10,3,10,4],[1,1,2,2],[3,1,3,2],[1,3,2,4],[9,1,9,2],[9,3,9,4]]}
[]
[null,"Side MDB Test",null,"Driver"]
[]
[null,{"$f":"'General Overview'!G6","v":""},null,"Value","Points"]
[null,"HEAD"]
[null,null,"Peak resultant acceleration - g"]
[null,null,"HIC15",null,{"$f":"ROUND(Sliding_Scale(D7,500,700,4,0),Round)","v":{"$error":"#NAME?"}}]
[null,null,"Resultant Acc. 3 msec exeedence - g",null,{"$f":"ROUND(Sliding_Scale(D8,72,80,4,0),Round)","v":{"$error":"#NAME?"}}]
[null,null,"Incorrect airbag deployment modifier (-1)",null,{"$f":"D9","v":0}]
[null,"Head assessment",null,{"$f":"MAX(MIN(E7:E8)+E9,0)","v":{"$error":"#NAME?"}}]
[]
[null,"CHEST"]
[]
[null,null,"Lateral compression - mm"]
[null,null,"Top",null,{"$f":"ROUND(Sliding_Scale(D15,28,50,4,0),Round)","v":{"$error":"#NAME?"}}]
[null,null,"Middle",null,{"$f":"ROUND(Sliding_Scale(D16,28,50,4,0),Round)","v":{"$error":"#NAME?"}}]
[null,null,"Bottom",null,{"$f":"ROUND(Sliding_Scale(D17,28,50,4,0),Round)","v":{"$error":"#NAME?"}}]
[null,"Chest rib assessment",null,null,{"$f":"MIN(E15:E17)","v":{"$error":"#NAME?"}}]
[null,null,"Shoulder Force modifier (-4)",null,{"$f":"IF(D20>=3,-4,0)","v":0}]
[null,null,"Shoulder Fy - kN"]
[null,null,"Viscous Criterion modifier (-4)",null,{"$f":"IF(OR(D22>=1,D23>=1,D24>=1),-4,0)","v":0}]
[null,null," Top rib Viscous Criterion - m/s"]
[null,null,"Middle rib Viscous Criterion - m/s"]
[null,null,"Bottom rib Viscous Criterion - m/s"]
[null,null,"Incorrect airbag deployment modifier (-1)",null,{"$f":"D25","v":0}]
[null,"Chest assessment",null,{"$f":"MAX(MIN(E15:E17)+SUM(E19,E21,E25),0)","v":{"$error":"#NAME?"}}]
[]
[null,"ABDOMEN"]
[null,null,"Lateral compression - mm"]
[null,null,"Top",null,{"$f":"ROUND(Sliding_Scale(D30,47,65,4,0),Round)","v":{"$error":"#NAME?"}}]
[null,null,"Bottom",null,{"$f":"ROUND(Sliding_Scale(D31,47,65,4,0),Round)","v":{"$error":"#NAME?"}}]
[null,"Abdomen rib assessment",null,null,{"$f":"MIN(E30:E31)","v":{"$error":"#NAME?"}}]
[null,null,"Viscous Criterion modifier (-4)",null,{"$f":"IF(OR(D34>=1,D35>=1),-4,0)","v":0}]
[null,null," Top rib Viscous Criterion - m/s"]
[null,null,"Bottom rib Viscous Criterion - m/s"]
[null,null,"Incorrect airbag deployment modifier (-1)",null,{"$f":"D36","v":0}]
[null,"Abdomen assessment",null,{"$f":"MAX(MIN(E30:E31)+SUM(E33,E36),0)","v":{"$error":"#NAME?"}}]
[]
[null,"PELVIS"]
[null,null,"Pubic Symphysis force - kN",null,{"$f":"ROUND(Sliding_Scale(D40,1.7,2.8,4,0),Round)","v":{"$error":"#NAME?"}}]
[null,null,"Incorrect airbag deployment modifier (-1)",null,{"$f":"D41","v":0}]
[null,"Pelvis assessment",null,{"$f":"MAX(E40+E41,0)","v":{"$error":"#NAME?"}}]
[]
[null,"SUMMARY"]
[null,null,"Head assessment",{"$f":"D10","v":{"$error":"#NAME?"}}]
[null,null,"Chest assessment",{"$f":"D26","v":{"$error":"#NAME?"}}]
[null,null,"Abdomen assessment",{"$f":"D37","v":{"$error":"#NAME?"}}]
[null,null,"Pelvis assessment",{"$f":"D42","v":{"$error":"#NAME?"}}]
[null,"DUMMY SCORE",null,{"$f":"SUM(D45:E48)","v":{"$error":"#NAME?"}}]
[]
[null,"Door Opening"]
[]
[null,"TOTAL SIDE MDB",null,{"$f":"ROUND(IF(OR(E7=0,E8=0,E15=0,E16=0,E17=0,E30=0,E31=0,E40=0),0,(D49+D51)/16*6),Round)","v":{"$error":"#NAME?"}}]
[]
[]
[]
[]
[]
[null,"DUMMY MEASUREMENTS"]
[null,"Head"]
[null,"Ax","Max"]
[null,null,"Min"]
[null,"Ay","Max"]
[null,null,"Min"]
[null,"Az","Max"]
[null,null,"Min"]
[null,"Neck"]
[null,"Fx","Max"]
[null,null,"Min"]
[null,"Fy","Max"]
[null,null,"Min"]
[null,"Fz","Max"]
[null,null,"Min"]
[null,"Mx","Max"]
[null,null,"Min"]
[null,"My","Max"]
[null,null,"Min"]
[null,"Mz","Max"]
[null,null,"Min"]
[null,"Shoulder"]
[null,"Fx","Max"]
[null,null,"Min"]
[null,"Fy","Max"]
[null,null,"Min"]
[null,"Fz","Max"]
[null,null,"Min"]
[null,"D","Max"]
[null,null,"Min"]
[null,"α","Max"]
[null,null,"Min"]
[null,"Thorax"]
[null,"D01","Max"]
[null,null,"Min"]
[null,"α01","Max"]
[null,null,"Min"]
[null,"D02","Max"]
[null,null,"Min"]
[null,"α02","Max"]
[null,null,"Min"]
[null,"D03","Max"]
[null,null,"Min"]
[null,"α03","Max"]
[null,null,"Min"]
[null,"Abdomen"]
[null,"D01","Max"]
[null,null,"Min"]
[null,"α01","Max"]
[null,null,"Min"]
[null,"D02","Max"]
[null,null,"Min"]
[null,"α02","Max"]
[null,null,"Min"]
[null,"T12"]
[null,"Ax","Max"]
[null,null,"Min"]
[null,"Ay","Max"]
[null,null,"Min"]
[null,"Az","Max"]
[null,null,"Min"]
[null,"Pelvis"]
[null,"Ax","Max"]
[null,null,"Min"]
[null,"Ay","Max"]
[null,null,"Min"]
[null,"Az","Max"]
[null,null,"Min"]
[null,"Fy","Max"]
[null,null,"Min"]
[null,"Femur (left)"]
[null,"Fx","Max"]
[null,null,"Min"]
[null,"Fy","Max"]
[null,null,"Min"]
[null,"Fz","Max"]
[null,"Femur (right)"]
[null,"Fx","Max"]
[null,null,"Min"]
[null,"Fy","Max"]
[null,null,"Min"]
[null,"Fz","Max"]
[]
[null,"VEHICLE MEASUREMENTS"]
[null,"Vehicle B-post"]
[null,"Ay","Max"]
[null,null,"Min"]
[null,"Trolley"]
[null,"Ax","Max"]
[null,null,"Min"]
[]
[null,"TEST DETAILS"]
[null,"Vehicle"]
[null,null,"VIN number"]
[null,null,"Test weight - kg"]
[null,"Test"]
[null,null,"Impact speed - km/h"]
[null,null,"Impact location - mm"]
[null,null,"Vertical"]
[null,null,"Horizontal"]

{"sheet":"AOP Side Pole","index":5,"n_rows":177,"n_cols":7,"rows_kept":177,"cut":false,"hidden":false,"merged":[[168,1,168,4],[77,1,77,4],[37,3,37,4],[42,3,42,4],[71,1,71,2],[43,1,43,2],[44,3,44,4],[45,3,45,4],[46,3,46,4],[47,3,47,4],[69,1,69,2],[50,3,50,4],[71,3,71,6],[67,1,67,2],[67,3,67,6],[69,3,69,6],[17,1,17,2],[11,3,11,4],[50,5,50,6],[25,1,25,2],[25,3,25,4],[31,1,31,2],[26,3,26,4],[36,1,36,2],[36,3,36,4],[41,1,41,2],[41,3,41,4],[48,1,48,2],[48,3,48,4],[1,1,2,2],[3,1,3,2],[10,3,10,4],[1,3,2,4],[10,1,10,2]]}
[]
[null,"Side Pole Test",null,"Driver"]
[]
[null,{"$f":"'General Overview'!G7","v":""},null,"Value","Points"]
[null,"HEAD"]
[null,null,"Direct head contact with pole",null,{"$f":"IF(D6=\"\",0,IF(D6=\"Yes\",0,4))","v":0}]
[null,null,"Peak resultant acceleration - g",null,{"$f":"IF(D7=\"\",0,IF(D7<80,4,0))","v":0}]
[null,null,"HIC15",null,{"$f":"IF(D8=\"\",0,IF(D8<700,4,0))","v":0}]
[null,null,"Resultant Acc. 3 msec exeedence - g"]
[null,null,"Incorrect airbag deployment modifier (-1)",null,{"$f":"D10","v":0}]
[null,"Head assessment",null,{"$f":"MAX(MIN(E6:E8)+E10,0)","v":0}]
[]
[null,"CHEST"]
[null,null,"Lateral compression - mm"]
[null,null,"Top",null,{"$f":"ROUND(Sliding_Scale(D15,28,50,4,0),Round)","v":{"$error":"#NAME?"}}]
[null,null,"Middle",null,{"$f":"ROUND(Sliding_Scale(D16,28,50,4,0),Round)","v":{"$error":"#NAME?"}}]
[null,null,"Bottom",null,{"$f":"ROUND(Sliding_Scale(D17,28,50,4,0),Round)","v":{"$error":"#NAME?"}}]
[null,"Chest rib assessment",null,null,{"$f":"MIN(E15:E17)","v":{"$error":"#NAME?"}}]
[null,null,"Shoulder Force modifier (-4)",null,{"$f":"IF(D20>=3,-4,0)","v":0}]
[null,null,"Shoulder Fy - kN"]
[null,null,"Viscous Criterion modifier (-4)",null,{"$f":"IF(OR(D22>=1,D23>=1,D24>=1),-4,0)","v":0}]
[null,null," Top rib Viscous Criterion - m/s"]
[null,null,"Middle rib Viscous Criterion - m/s"]
[null,null,"Bottom rib Viscous Criterion - m/s"]
[null,null,"Incorrect airbag deployment modifier (-1)",null,{"$f":"D25","v":0}]
[null,"Chest assessment",null,{"$f":"MAX(MIN(E15:E17)+SUM(E19,E21,E25),0)","v":{"$error":"#NAME?"}}]
[]
[null,"ABDOMEN"]
[null,null,"Lateral compression - mm"]
[null,null,"Top",null,{"$f":"ROUND(Sliding_Scale(D30,47,65,4,0),Round)","v":{"$error":"#NAME?"}}]
[null,null,"Bottom",null,{"$f":"ROUND(Sliding_Scale(D31,47,65,4,0),Round)","v":{"$error":"#NAME?"}}]
[null,"Abdomen rib assessment",null,null,{"$f":"MIN(E30:E31)","v":{"$error":"#NAME?"}}]
[null,null,"Viscous Criterion modifier (-4)",null,{"$f":"IF(OR(D34>=1,D35>=1),-4,0)","v":0}]
[null,null," Top rib Viscous Criterion - m/s"]
[null,null,"Bottom rib Viscous Criterion - m/s"]
[null,null,"Incorrect airbag deployment modifier (-1)",null,{"$f":"D36","v":0}]
[null,"Abdomen assessment",null,{"$f":"MAX(MIN(E30:E31)+SUM(E33,E36),0)","v":{"$error":"#NAME?"}}]
[]
[null,"PELVIS"]
[null,null,"Pubic Symphysis force - kN",null,{"$f":"ROUND(Sliding_Scale(D40,1.7,2.8,4,0),Round)","v":{"$error":"#NAME?"}}]
[null,null,"Incorrect airbag deployment modifier (-1)",null,{"$f":"D41","v":0}]
[null,"Pelvis assessment",null,{"$f":"MAX(E40+E41,0)","v":{"$error":"#NAME?"}}]
[]
[null,"SUMMARY"]
[null,null,"Head assessment",{"$f":"D11","v":0}]
[null,null,"Chest assessment",{"$f":"D26","v":{"$error":"#NAME?"}}]
[null,null,"Abdomen assessment",{"$f":"D37","v":{"$error":"#NAME?"}}]
[null,null,"Pelvis assessment",{"$f":"D42","v":{"$error":"#NAME?"}}]
[null,"DUMMY SCORE",null,{"$f":"SUM(D45:E48)","v":{"$error":"#NAME?"}}]
[]
[null,"HPD Assessment",null,"FRONT SEATS",null,"REAR SEATS"]
[null,null,"H-point"]
[null,null,"H-point(X) - mm"]
[null,null,"H-point(Z) - mm"]
[null,null,"seat travel 5th-50th - mm"]
[null,null,"seat travel 50th-95th - mm"]
[null,null,"rear seat travel - mm"]
[]
[null,null,"XCoG,5th",{"$f":"D53+126-D55","v":126},null,{"$f":"F53+126-F57","v":126}]
[null,null,"ZCoG,5th",{"$f":"D54+594","v":594},null,{"$f":"F54+594","v":594}]
[null,null,"XCoG,95th",{"$f":"D53+147+D56","v":147},null,{"$f":"F53+147","v":147}]
[null,null,"ZCoG,95th",{"$f":"D54+693","v":693},null,{"$f":"F54+693","v":693}]
[]
[null,null,"HPD modifier (-2/-4)",null,{"$f":"IF(D65=\"OEM data\",0,IF(OR(D65=\"Fail\",D66=\"Fail\",D67=\"Fail\"),-2*IF('General Overview'!C17=0,2,1),0))","v":0},null,{"$f":"IF(F65=\"OEM data\",0,IF(OR(F65=\"Fail\",F66=\"Fail\",F67=\"Fail\"),-2,0))","v":0}]
[null,null,"HPD assessment zone coverage"]
[null,null,"seems within HPD no wider than 15mm"]
[null,null,"uninflated areas no larger than 50mm"]
[null,"HPD assessment",null,{"$f":"E64+G64","v":0}]
[]
[null,"Door Opening"]
[]
[null,"TOTAL SIDE POLE",null,{"$f":"MAX(ROUND(IF(OR(D6=\"Yes\",E7=0,E8=0,D15>=55,D16>=55,D17>=55,E30=0,E31=0,E40=0),0,(D49+D68+D70)/16*6),Round),0)","v":{"$error":"#NAME?"}}]
[]
[]
[]
[]
[]
[null,"DUMMY MEASUREMENTS"]
[null,"Head"]
[null,"Ax","Max"]
[null,null,"Min"]
[null,"Ay","Max"]
[null,null,"Min"]
[null,"Az","Max"]
[null,null,"Min"]
[null,"Neck"]
[null,"Fx","Max"]
[null,null,"Min"]
[null,"Fy","Max"]
[null,null,"Min"]
[null,"Fz","Max"]
[null,null,"Min"]
[null,"Mx","Max"]
[null,null,"Min"]
[null,"My","Max"]
[null,null,"Min"]
[null,"Mz","Max"]
[null,null,"Min"]
[null,"Shoulder"]
[null,"Fx","Max"]
[null,null,"Min"]
[null,"Fy","Max"]
[null,null,"Min"]
[null,"Fz","Max"]
[null,null,"Min"]
[null,"D","Max"]
[null,null,"Min"]
[null,"α","Max"]
[null,null,"Min"]
[null,"Thorax"]
[null,"D01","Max"]
[null,null,"Min"]
[null,"α01","Max"]
[null,null,"Min"]
[null,"D02","Max"]
[null,null,"Min"]
[null,"α02","Max"]
[null,null,"Min"]
[null,"D03","Max"]
[null,null,"Min"]
[null,"α03","Max"]
[null,null,"Min"]
[null,"Abdomen"]
[null,"D01","Max"]
[null,null,"Min"]
[null,"α01","Max"]
[null,null,"Min"]
[null,"D02","Max"]
[null,null,"Min"]
[null,"α02","Max"]
[null,null,"Min"]
[null,"T12"]
[null,"Ax","Max"]
[null,null,"Min"]
[null,"Ay","Max"]
[null,null,"Min"]
[null,"Az","Max"]
[null,null,"Min"]
[null,"Pelvis"]
[null,"Ax","Max"]
[null,null,"Min"]
[null,"Ay","Max"]
[null,null,"Min"]
[null,"Az","Max"]
[null,null,"Min"]
[null,"Fy","Max"]
[null,null,"Min"]
[null,"Femur (left)"]
[null,"Fx","Max"]
[null,null,"Min"]
[null,"Fy","Max"]
[null,null,"Min"]
[null,"Fz","Max"]
[null,"Femur (right)"]
[null,"Fx","Max"]
[null,null,"Min"]
[null,"Fy","Max"]
[null,null,"Min"]
[null,"Fz","Max"]
[]
[null,"VEHICLE MEASUREMENTS"]
[null,"Vehicle B-post"]
[null,"Ay","Max"]
[null,null,"Min"]
[null,"Trolley"]
[null,"Ax","Max"]
[null,null,"Min"]
[]
[null,"TEST DETAILS"]
[null,"Vehicle"]
[null,null,"VIN number"]
[null,null,"Test weight - kg"]
[null,"Test"]
[null,null,"Impact speed - km/h"]
[null,null,"Impact location - mm"]
[null,null,"Vertical"]
[null,null,"Horizontal"]

{"sheet":"AOP Farside","index":6,"n_rows":69,"n_cols":7,"rows_kept":69,"cut":false,"hidden":false,"merged":[[60,3,60,4],[60,5,60,6],[7,3,7,4],[7,5,7,6],[30,5,30,6],[11,5,11,6],[12,5,12,6],[42,5,42,6],[43,5,43,6],[54,5,54,6],[55,5,55,6],[56,1,56,2],[56,3,56,4],[42,1,42,2],[42,3,42,4],[18,3,18,4],[36,1,36,2],[40,1,40,2],[29,1,29,2],[29,3,29,4],[30,3,30,4],[41,1,41,4],[43,3,43,4],[55,3,55,4],[54,3,54,4],[53,3,53,4],[68,1,68,2],[49,1,49,2],[49,3,49,4],[50,3,50,4],[51,1,51,2],[52,3,52,4],[68,3,68,6],[66,1,66,2],[66,3,66,6],[58,1,58,2],[58,3,58,4],[58,5,58,6],[56,5,56,6],[53,5,53,6],[50,5,50,6],[52,5,52,6],[1,1,2,2],[1,3,2,4],[3,1,3,2],[17,1,17,2],[17,3,17,4],[11,3,11,4],[12,3,12,4],[11,1,11,2],[5,3,5,4],[6,3,6,4],[1,5,2,6],[17,5,17,6],[18,5,18,6],[29,5,29,6],[49,5,49,6],[5,5,5,6],[6,5,6,6]]}
[]
[null,"Far Side Tests",null,"AE-MDB",null,"Pole"]
[]
[null,"OEM DATA",null,"Value","Points","Value","Points"]
[null,"PREREQUISITE"]
[null,null,"Structural failure"]
[null,null,"Restraint failure"]
[]
[null,"EXCURSION ZONE"]
[null,null,"Excursion zone"]
[null,null,"Red line >125 mm outboard of the orange line"]
[null,"Excursion zone scaling factor",null,{"$f":"IF('General Overview'!E33=\"Standard\",IF(OR(D10=\"Green\",D10=\"Yellow\"),\"100%\",IF(D10=\"Orange\",\"75%\",IF(D10=\"Red\",IF(D11=\"No\",\"Head & Chest 0 points\",IF(D11=\"Yes\",\"Head 2 points & Chest 0 points\",\"Enter data in D10\")),IF(D10=\"Capping\",\"Both tests capped\",\"No excursion entered\")))),IF(D10=\"Green\",\"100%\",IF(D10=\"Yellow\",\"50%\",IF(D10=\"Orange\",\"25%\",IF(D10=\"Red\",\"25% and Head & Chest 0 points\",IF(D10=\"Capping\",\"Both tests capped\",\"No excursion entered\"))))))","v":"No excursion entered"},null,{"$f":"IF('General Overview'!E33=\"Standard\",IF(OR(F10=\"Green\",F10=\"Yellow\"),\"100%\",IF(F10=\"Orange\",\"75%\",IF(F10=\"Red\",IF(F11=\"No\",\"Head & Chest 0 points\",IF(F11=\"Yes\",\"Head 2 points & Chest 0 points\",\"Enter data in D10\")),IF(F10=\"Capping\",\"Both tests capped\",\"No excursion entered\")))),IF(F10=\"Green\",\"100%\",IF(F10=\"Yellow\",\"50%\",IF(F10=\"Orange\",\"25%\",IF(F10=\"Red\",\"25% and Head & Chest 0 points\",IF(F10=\"Capping\",\"Both tests capped\",\"No excursion entered\"))))))","v":"No excursion entered"}]
[]
[null,"HEAD"]
[null,null,"Hard contact"]
[null,null,"HIC15",null,{"$f":"IF(D15=\"Yes\",Sliding_Scale(D16,500,700,IF('General Overview'!E33=\"Standard\",IF(OR(D10=\"Green\",D10=\"Yellow\"),4,IF(D10=\"Orange\",3,IF(D10=\"Red\",IF(D11=\"No\",0,IF(D11=\"Yes\",2)),IF(D10=\"Capping\",0,0)))),IF(D10=\"Green\",4,IF(D10=\"Yellow\",2,IF(D10=\"Orange\",1,IF(D10=\"Red\",0,IF(D10=\"Capping\",0,0)))))),0),\"\")","v":""},null,{"$f":"IF(F15=\"Yes\",Sliding_Scale(F16,500,700,IF('General Overview'!E33=\"Standard\",IF(OR(F10=\"Green\",F10=\"Yellow\"),4,IF(F10=\"Orange\",3,IF(F10=\"Red\",IF(F11=\"No\",0,IF(F11=\"Yes\",2)),IF(F10=\"Capping\",0,0)))),IF(F10=\"Green\",4,IF(F10=\"Yellow\",2,IF(F10=\"Orange\",1,IF(F10=\"Red\",0,IF(F10=\"Capping\",0,0)))))),0),\"\")","v":""}]
[null,null,"Resultant Acc. 3 msec exeedence - g",null,{"$f":"Sliding_Scale(D17,72,80,IF('General Overview'!E33=\"Standard\",IF(OR(D10=\"Green\",D10=\"Yellow\"),4,IF(D10=\"Orange\",3,IF(D10=\"Red\",IF(D11=\"No\",0,IF(D11=\"Yes\",2)),IF(D10=\"Capping\",0,0)))),IF(D10=\"Green\",4,IF(D10=\"Yellow\",2,IF(D10=\"Orange\",1,IF(D10=\"Red\",0,IF(D10=\"Capping\",0,0)))))),0)","v":{"$error":"#NAME?"}},null,{"$f":"Sliding_Scale(F17,72,80,IF('General Overview'!E33=\"Standard\",IF(OR(F10=\"Green\",F10=\"Yellow\"),4,IF(F10=\"Orange\",3,IF(F10=\"Red\",IF(F11=\"No\",0,IF(F11=\"Yes\",2)),IF(F10=\"Capping\",0,0)))),IF(F10=\"Green\",4,IF(F10=\"Yellow\",2,IF(F10=\"Orange\",1,IF(F10=\"Red\",0,IF(F10=\"Capping\",0,0)))))),0)","v":{"$error":"#NAME?"}}]
[null,"Head assessment",null,{"$f":"MIN(E16:E17)","v":{"$error":"#NAME?"}},null,{"$f":"MIN(G16:G17)","v":{"$error":"#NAME?"}}]
[]
[null,"NECK"]
[null,null,"Tension Fz - kN"]
[null,null,"Upper Neck",null,{"$f":"IF(D22=\"\",0,IF(D22<=3.74,IF('General Overview'!E33=\"Standard\",IF(OR(D10=\"Green\",D10=\"Yellow\"),4,IF(D10=\"Orange\",3,IF(D10=\"Red\",4,IF(D10=\"Capping\",0,0)))),IF(D10=\"Green\",4,IF(D10=\"Yellow\",2,IF(D10=\"Orange\",1,IF(D10=\"Red\",1,IF(D10=\"Capping\",0,0)))))),0))","v":0},null,{"$f":"IF(F22=\"\",0,IF(F22<=3.74,IF('General Overview'!E33=\"Standard\",IF(OR(F10=\"Green\",F10=\"Yellow\"),4,IF(F10=\"Orange\",3,IF(F10=\"Red\",4,IF(F10=\"Capping\",0,0)))),IF(F10=\"Green\",4,IF(F10=\"Yellow\",2,IF(F10=\"Orange\",1,IF(F10=\"Red\",1,IF(F10=\"Capping\",0,0)))))),0))","v":0}]
[null,null,"Lower Neck",null,{"$f":"IF(D23=\"\",0,IF(D23<=3.74,IF('General Overview'!E33=\"Standard\",IF(OR(D10=\"Green\",D10=\"Yellow\"),4,IF(D10=\"Orange\",3,IF(D10=\"Red\",4,IF(D10=\"Capping\",0,0)))),IF(D10=\"Green\",4,IF(D10=\"Yellow\",2,IF(D10=\"Orange\",1,IF(D10=\"Red\",1,IF(D10=\"Capping\",0,0)))))),0))","v":0},null,{"$f":"IF(F23=\"\",0,IF(F23<=3.74,IF('General Overview'!E33=\"Standard\",IF(OR(F10=\"Green\",F10=\"Yellow\"),4,IF(F10=\"Orange\",3,IF(F10=\"Red\",4,IF(F10=\"Capping\",0,0)))),IF(F10=\"Green\",4,IF(F10=\"Yellow\",2,IF(F10=\"Orange\",1,IF(F10=\"Red\",1,IF(F10=\"Capping\",0,0)))))),0))","v":0}]
[null,null,"Lateral Flexion - Nm"]
[null,null,"MxOC",null,{"$f":"Sliding_Scale(D25,162,248,IF('General Overview'!E33=\"Standard\",IF(OR(D10=\"Green\",D10=\"Yellow\"),4,IF(D10=\"Orange\",3,IF(D10=\"Red\",4,IF(D10=\"Capping\",0,0)))),IF(D10=\"Green\",4,IF(D10=\"Yellow\",2,IF(D10=\"Orange\",1,IF(D10=\"Red\",1,IF(D10=\"Capping\",0,0)))))),0)","v":{"$error":"#NAME?"}},null,{"$f":"Sliding_Scale(F25,162,248,IF('General Overview'!E33=\"Standard\",IF(OR(F10=\"Green\",F10=\"Yellow\"),4,IF(F10=\"Orange\",3,IF(F10=\"Red\",4,IF(F10=\"Capping\",0,0)))),IF(F10=\"Green\",4,IF(F10=\"Yellow\",2,IF(F10=\"Orange\",1,IF(F10=\"Red\",1,IF(F10=\"Capping\",0,0)))))),0)","v":{"$error":"#NAME?"}}]
[null,null,"Mx (base of neck)",null,{"$f":"Sliding_Scale(D26,162,248,IF('General Overview'!E33=\"Standard\",IF(OR(D10=\"Green\",D10=\"Yellow\"),4,IF(D10=\"Orange\",3,IF(D10=\"Red\",4,IF(D10=\"Capping\",0,0)))),IF(D10=\"Green\",4,IF(D10=\"Yellow\",2,IF(D10=\"Orange\",1,IF(D10=\"Red\",1,IF(D10=\"Capping\",0,0)))))),0)","v":{"$error":"#NAME?"}},null,{"$f":"Sliding_Scale(F26,162,248,IF('General Overview'!E33=\"Standard\",IF(OR(F10=\"Green\",F10=\"Yellow\"),4,IF(F10=\"Orange\",3,IF(F10=\"Red\",4,IF(F10=\"Capping\",0,0)))),IF(F10=\"Green\",4,IF(F10=\"Yellow\",2,IF(F10=\"Orange\",1,IF(F10=\"Red\",1,IF(F10=\"Capping\",0,0)))))),0)","v":{"$error":"#NAME?"}}]
[null,null,"Extension - Nm"]
[null,null,"MyOC",null,{"$f":"IF(D28=\"\",0,IF(D28<=50,IF('General Overview'!E33=\"Standard\",IF(OR(D10=\"Green\",D10=\"Yellow\"),4,IF(D10=\"Orange\",3,IF(D10=\"Red\",4,IF(D10=\"Capping\",0,0)))),IF(D10=\"Green\",4,IF(D10=\"Yellow\",2,IF(D10=\"Orange\",1,IF(D10=\"Red\",1,IF(D10=\"Capping\",0,0)))))),0))","v":0},null,{"$f":"IF(F28=\"\",0,IF(F28<=50,IF('General Overview'!E33=\"Standard\",IF(OR(F10=\"Green\",F10=\"Yellow\"),4,IF(F10=\"Orange\",3,IF(F10=\"Red\",4,IF(F10=\"Capping\",0,0)))),IF(F10=\"Green\",4,IF(F10=\"Yellow\",2,IF(F10=\"Orange\",1,IF(F10=\"Red\",1,IF(F10=\"Capping\",0,0)))))),0))","v":0}]
[null,null,"My (base of neck)"]
[null,"Neck assessment",null,{"$f":"MIN(E22:E29)","v":{"$error":"#NAME?"}},null,{"$f":"MIN(G22:G29)","v":{"$error":"#NAME?"}}]
[]
[null,"CHEST & ABDOMEN"]
[null,null,"Lateral compression - mm"]
[null,null,"Top",null,{"$f":"ROUND(Sliding_Scale(D34,28,50,IF('General Overview'!E33=\"Standard\",IF(OR(D10=\"Green\",D10=\"Yellow\"),4,IF(D10=\"Orange\",3,IF(D10=\"Red\",0,IF(D10=\"Capping\",0,0)))),IF(D10=\"Green\",4,IF(D10=\"Yellow\",2,IF(D10=\"Orange\",1,IF(D10=\"Red\",0,IF(D10=\"Capping\",0,0)))))),0),Round)","v":{"$error":"#NAME?"}},null,{"$f":"ROUND(Sliding_Scale(F34,28,50,IF('General Overview'!E33=\"Standard\",IF(OR(F10=\"Green\",F10=\"Yellow\"),4,IF(F10=\"Orange\",3,IF(F10=\"Red\",0,IF(F10=\"Capping\",0,0)))),IF(F10=\"Green\",4,IF(F10=\"Yellow\",2,IF(F10=\"Orange\",1,IF(F10=\"Red\",0,IF(F10=\"Capping\",0,0)))))),0),Round)","v":{"$error":"#NAME?"}}]
[null,null,"Middle",null,{"$f":"ROUND(Sliding_Scale(D35,28,50,IF('General Overview'!E33=\"Standard\",IF(OR(D10=\"Green\",D10=\"Yellow\"),4,IF(D10=\"Orange\",3,IF(D10=\"Red\",0,IF(D10=\"Capping\",0,0)))),IF(D10=\"Green\",4,IF(D10=\"Yellow\",2,IF(D10=\"Orange\",1,IF(D10=\"Red\",0,IF(D10=\"Capping\",0,0)))))),0),Round)","v":{"$error":"#NAME?"}},null,{"$f":"ROUND(Sliding_Scale(F35,28,50,IF('General Overview'!E33=\"Standard\",IF(OR(F10=\"Green\",F10=\"Yellow\"),4,IF(F10=\"Orange\",3,IF(F10=\"Red\",0,IF(F10=\"Capping\",0,0)))),IF(F10=\"Green\",4,IF(F10=\"Yellow\",2,IF(F10=\"Orange\",1,IF(F10=\"Red\",0,IF(F10=\"Capping\",0,0)))))),0),Round)","v":{"$error":"#NAME?"}}]
[null,null,"Bottom",null,{"$f":"ROUND(Sliding_Scale(D36,28,50,IF('General Overview'!E33=\"Standard\",IF(OR(D10=\"Green\",D10=\"Yellow\"),4,IF(D10=\"Orange\",3,IF(D10=\"Red\",0,IF(D10=\"Capping\",0,0)))),IF(D10=\"Green\",4,IF(D10=\"Yellow\",2,IF(D10=\"Orange\",1,IF(D10=\"Red\",0,IF(D10=\"Capping\",0,0)))))),0),Round)","v":{"$error":"#NAME?"}},null,{"$f":"ROUND(Sliding_Scale(F36,28,50,IF('General Overview'!E33=\"Standard\",IF(OR(F10=\"Green\",F10=\"Yellow\"),4,IF(F10=\"Orange\",3,IF(F10=\"Red\",0,IF(F10=\"Capping\",0,0)))),IF(F10=\"Green\",4,IF(F10=\"Yellow\",2,IF(F10=\"Orange\",1,IF(F10=\"Red\",0,IF(F10=\"Capping\",0,0)))))),0),Round)","v":{"$error":"#NAME?"}}]
[null,"Chest rib assessment",null,null,{"$f":"MIN(E34:E36)","v":{"$error":"#NAME?"}},null,{"$f":"MIN(G34:G36)","v":{"$error":"#NAME?"}}]
[null,null,"Lateral compression - mm"]
[null,null,"Top",null,{"$f":"ROUND(Sliding_Scale(D39,47,65,IF('General Overview'!E33=\"Standard\",IF(OR(D10=\"Green\",D10=\"Yellow\"),4,IF(D10=\"Orange\",3,IF(D10=\"Red\",0,IF(D10=\"Capping\",0,0)))),IF(D10=\"Green\",4,IF(D10=\"Yellow\",2,IF(D10=\"Orange\",1,IF(D10=\"Red\",0,IF(D10=\"Capping\",0,0)))))),0),Round)","v":{"$error":"#NAME?"}},null,{"$f":"ROUND(Sliding_Scale(F39,47,65,IF('General Overview'!E33=\"Standard\",IF(OR(F10=\"Green\",F10=\"Yellow\"),4,IF(F10=\"Orange\",3,IF(F10=\"Red\",0,IF(F10=\"Capping\",0,0)))),IF(F10=\"Green\",4,IF(F10=\"Yellow\",2,IF(F10=\"Orange\",1,IF(F10=\"Red\",0,IF(F10=\"Capping\",0,0)))))),0),Round)","v":{"$error":"#NAME?"}}]
[null,null,"Bottom",null,{"$f":"ROUND(Sliding_Scale(D40,47,65,IF('General Overview'!E33=\"Standard\",IF(OR(D10=\"Green\",D10=\"Yellow\"),4,IF(D10=\"Orange\",3,IF(D10=\"Red\",0,IF(D10=\"Capping\",0,0)))),IF(D10=\"Green\",4,IF(D10=\"Yellow\",2,IF(D10=\"Orange\",1,IF(D10=\"Red\",0,IF(D10=\"Capping\",0,0)))))),0),Round)","v":{"$error":"#NAME?"}},null,{"$f":"ROUND(Sliding_Scale(F40,47,65,IF('General Overview'!E33=\"Standard\",IF(OR(F10=\"Green\",F10=\"Yellow\"),4,IF(F10=\"Orange\",3,IF(F10=\"Red\",0,IF(F10=\"Capping\",0,0)))),IF(F10=\"Green\",4,IF(F10=\"Yellow\",2,IF(F10=\"Orange\",1,IF(F10=\"Red\",0,IF(F10=\"Capping\",0,0)))))),0),Round)","v":{"$error":"#NAME?"}}]
[null,"Abdomen rib assessment",null,null,{"$f":"MIN(E39:E40)","v":{"$error":"#NAME?"}},null,{"$f":"MIN(G39:G40)","v":{"$error":"#NAME?"}}]
[]
[null,"Chest & Abdomen assessment",null,{"$f":"MIN(E37,E41)","v":{"$error":"#NAME?"}},null,{"$f":"MIN(G37,G41)","v":{"$error":"#NAME?"}}]
[]
[null,"PELVIS"]
[null,null,"Pubic Symphysis force - kN",null,{"$f":"IF(D46>2.8,-4,0)","v":0},null,{"$f":"IF(F46>2.8,-4,0)","v":0}]
[null,null,"Lumbar Fy - kN",null,{"$f":"IF(D47>2,-4,0)","v":0},null,{"$f":"IF(F47>2,-4,0)","v":0}]
[null,null,"Lumbar Fz - kN",null,{"$f":"IF(D48>3.5,-4,0)","v":0},null,{"$f":"IF(F48>3.5,-4,0)","v":0}]
[null,null,"Lumbar Mx - Nm",null,{"$f":"IF(D49>120,-4,0)","v":0},null,{"$f":"IF(F49>120,-4,0)","v":0}]
[null,"Pelvis assessment",null,{"$f":"IF(COUNTIF(E46:E49,-4)>0,-4,0)","v":0},null,{"$f":"IF(COUNTIF(G46:G49,-4)>0,-4,0)","v":0}]
[]
[null,"SUMMARY"]
[null,null,"Head assessment",{"$f":"D18","v":{"$error":"#NAME?"}},null,{"$f":"F18","v":{"$error":"#NAME?"}}]
[null,null,"Neck assessment",{"$f":"D30","v":{"$error":"#NAME?"}},null,{"$f":"F30","v":{"$error":"#NAME?"}}]
[null,null,"Chest & Abdomen assessment",{"$f":"D43","v":{"$error":"#NAME?"}},null,{"$f":"F43","v":{"$error":"#NAME?"}}]
[null,null,"Pelvis assessment",{"$f":"D50","v":0},null,{"$f":"F50","v":0}]
[null,"DUMMY SCORE",null,{"$f":"SUM(D53:E56)","v":{"$error":"#NAME?"}},null,{"$f":"SUM(F53:G56)","v":{"$error":"#NAME?"}}]
[]
[null,"TEST SCORE",null,{"$f":"IF(OR(D10=\"Capping\",F10=\"Capping\"),0,IF(OR(D16>700,D17>80,D34>50,D35>50,D36>50,D39>65,D40>65),0,MAX(SUM(D53:E56),0)))/12*2","v":{"$error":"#NAME?"}},null,{"$f":"IF(OR(D10=\"Capping\",F10=\"Capping\"),0,IF(OR(F16>700,F17>80,F34>50,F35>50,F36>50,F39>65,F40>65),0,MAX(SUM(F53:G56),0)))/12*2","v":{"$error":"#NAME?"}}]
[]
[null,"OCCUPANT-TO-OCCUPANT",null,"DRIVER",null,"PASSENGER"]
[null,null,"Head-to-Head contact (from video)",null,{"$f":"IF(D62=\"Yes\",-1,0)","v":0},null,{"$f":"IF(F62=\"Yes\",-1,0)","v":0}]
[null,null,"HIC15",null,{"$f":"IF(D63>700,-1,0)","v":0},null,{"$f":"IF(F63>700,-1,0)","v":0}]
[null,null,"Resultant Acc. 3 msec exeedence - g",null,{"$f":"IF(D64>80,-1,0)","v":0},null,{"$f":"IF(F64>80,-1,0)","v":0}]
[null,null,"Symmetrical performance",null,{"$f":"IF(D65=\"FAIL\",-1,0)","v":0},null,{"$f":"IF(F65=\"FAIL\",-1,0)","v":0}]
[null,null,"Protection Zone",null,{"$f":"IF(D66=\"FAIL\",-1,0)","v":0},null,{"$f":"IF(F66=\"FAIL\",-1,0)","v":0}]
[null,"Occupant-to-Occupant Head Contact Assessment",null,{"$f":"MIN(E62:E66,G62:G66)","v":0}]
[]
[null,"TOTAL FARSIDE",null,{"$f":"IF(COUNTIF(D6:G7,\"Yes\")>0,0,MAX(ROUND((D59+F59)+D67,Round),0))","v":{"$error":"#NAME?"}}]

{"sheet":"AOP Whiplash","index":7,"n_rows":153,"n_cols":7,"rows_kept":153,"cut":false,"hidden":false,"merged":[[73,3,73,6],[35,4,36,4],[35,6,36,6],[66,3,66,6],[67,3,67,6],[68,3,68,6],[70,3,70,6],[71,3,71,6],[61,3,61,4],[61,5,61,6],[56,3,56,4],[57,3,57,4],[58,3,58,4],[59,3,59,4],[60,3,60,4],[54,3,54,4],[1,1,2,2],[1,3,2,4],[1,5,2,6],[3,1,3,2],[5,3,5,6],[6,3,6,6],[73,1,73,2],[149,1,149,6],[39,1,39,2],[39,3,39,4],[39,5,39,6],[46,3,46,4],[46,5,46,6],[70,1,70,2],[71,1,71,2],[63,1,63,2],[65,1,65,2],[63,3,63,4],[63,5,63,6],[65,3,65,6],[61,1,61,2],[53,1,53,2],[46,1,46,2],[40,3,40,4],[40,5,40,6],[53,3,53,4],[53,5,53,6],[12,1,12,2],[20,1,20,2],[22,1,22,2],[12,3,12,6],[20,3,20,6],[22,3,22,6],[59,5,59,6],[60,5,60,6],[56,5,56,6],[54,5,54,6],[55,5,55,6],[57,5,57,6],[58,5,58,6]]}
[]
[null,"Whiplash Tests",null,"Mid Pulse",null,"High Pulse"]
[]
[null,{"$f":"'General Overview'!G9","v":""},null,"Value","Points","Value","Points"]
[null,"SEAT SPECIFICATION"]
[null,null,"Type of headrest"]
[null,null,"Type of seat"]
[]
[null,"STATIC"]
[null,null,"Test position"]
[null,null,"Effective Height  - mm",null,{"$f":"ROUND(Sliding_Scale(D11,755,825,-1,1),Round)","v":{"$error":"#NAME?"}},null,{"$f":"ROUND(Sliding_Scale(F11,755,825,-1,1),Round)","v":{"$error":"#NAME?"}}]
[null,null,"Backset - mm",null,{"$f":"IF(D12=\"\",0,IF(D12<45,1,-1))","v":0},null,{"$f":"IF(F12=\"\",0,IF(F12<45,1,-1))","v":0}]
[null,"Geometric assessment (test position)",null,{"$f":"MIN(AVERAGE(E11,G11),AVERAGE(E12,G12))","v":{"$error":"#NAME?"}}]
[]
[null,null,"Down/Back"]
[null,null,"Effective Height  - mm",null,{"$f":"IF(D16=\"\",\"FAIL\",IF(D16>790,\"PASS\",\"FAIL\"))","v":"FAIL"},null,{"$f":"IF(F16=\"\",\"FAIL\",IF(F16>790,\"PASS\",\"FAIL\"))","v":"FAIL"}]
[null,null,"Backset - mm",null,{"$f":"IF(D17=\"\",\"FAIL\",IF(D17<70,\"PASS\",\"FAIL\"))","v":"FAIL"},null,{"$f":"IF(F17=\"\",\"FAIL\",IF(F17<70,\"PASS\",\"FAIL\"))","v":"FAIL"}]
[]
[null,null,"Passenger Effective Height  - mm",null,{"$f":"IF(D19=\"\",\"FAIL\",IF(D19>790,\"PASS\",\"FAIL\"))","v":"FAIL"},null,{"$f":"IF(F19=\"\",\"FAIL\",IF(F19>790,\"PASS\",\"FAIL\"))","v":"FAIL"}]
[null,null,"Passenger Backset - mm",null,{"$f":"IF(D20=\"\",\"FAIL\",IF(D20<70,\"PASS\",\"FAIL\"))","v":"FAIL"},null,{"$f":"IF(F20=\"\",\"FAIL\",IF(F20<70,\"PASS\",\"FAIL\"))","v":"FAIL"}]
[null,"Ease of Adjustment",null,{"$f":"IF(D68>3,IF(COUNTIF((D16:G17),\"FAIL\")>0,0,0.5)+IF(COUNTIF((D19:G20),\"FAIL\")>0,0,0.5),0)","v":{"$error":"#NAME?"}}]
[]
[null,"Static assessment",null,{"$f":"SUM(D13,D21)","v":{"$error":"#NAME?"}}]
[]
[null,"DYNAMIC"]
[null,null,"NIC max - m2/s2",null,{"$f":"IF(D26>27,\"Test Capped\",ROUND(Sliding_Scale(D26,11,24,1,0),Round))","v":{"$error":"#NAME?"}},null,{"$f":"IF(F26>25.5,\"Test Capped\",ROUND(Sliding_Scale(F26,13,23,1,0),Round))","v":{"$error":"#NAME?"}}]
[null,null,"UPPER Neck Shear (+Fx) - N",null,{"$f":"IF(D27>290,\"Test Capped\",ROUND(Sliding_Scale(D27,30,190,1,0),Round))","v":{"$error":"#NAME?"}},null,{"$f":"IF(F27>364,\"Test Capped\",ROUND(Sliding_Scale(F27,30,210,1,0),Round))","v":{"$error":"#NAME?"}}]
[null,null,"UPPER Neck Tension (+Fz) - N",null,{"$f":"IF(D28>900,\"Test Capped\",ROUND(Sliding_Scale(D28,360,750,1,0),Round))","v":{"$error":"#NAME?"}},null,{"$f":"IF(F28>1024,\"Test Capped\",ROUND(Sliding_Scale(F28,470,770,1,0),Round))","v":{"$error":"#NAME?"}}]
[]
[null,null,"Nkm ",null,{"$f":"IF(D30>0.69,\"Test Capped\",\"\" )","v":""},null,{"$f":"IF(F30>0.78,\"Test Capped\",\"\" )","v":""}]
[null,null,"Rebound velocity - m/s",null,{"$f":"IF(D31>5.2,\"Test Capped\",\"\" )","v":""},null,{"$f":"IF(F31>6,\"Test Capped\",\"\" )","v":""}]
[null,null,"UPPER Neck Shear (-Fx) - N",null,{"$f":"IF(D32>360,\"Test Capped\",\"\" )","v":""},null,{"$f":"IF(F32>360,\"Test Capped\",\"\" )","v":""}]
[null,null,"UPPER Neck Extension & Flexion (My) - Nm",null,{"$f":"IF(D33>30,\"Test Capped\",\"\" )","v":""},null,{"$f":"IF(F33>30,\"Test Capped\",\"\" )","v":""}]
[null,null,"LOWER Neck Shear (ABS(Fx)) - N",null,{"$f":"IF(D34>360,\"Test Capped\",\"\" )","v":""},null,{"$f":"IF(F34>360,\"Test Capped\",\"\" )","v":""}]
[null,null,"LOWER Neck Extension & Flexion (My) - N",null,{"$f":"IF(D35>30,\"Test Capped\",\"\" )","v":""},null,{"$f":"IF(F35>30,\"Test Capped\",\"\" )","v":""}]
[null,null,"T1 x-acc - g",null,{"$f":"IF(AND(D36>15.55,D37>92),\"Test Capped\",\"\" )","v":""},null,{"$f":"IF(AND(F36>17.8,F37>92),\"Test Capped\",\"\" )","v":""}]
[null,null,"Head contact start - ms"]
[]
[null,null,"Max Seat Back Dynamic Deflection - degree",null,null,null,{"$f":"IF(F39>32,\"Test Capped\",\"\" )","v":""}]
[null,"Dynamic assessment",null,{"$f":"IF(COUNTIF(E26:E39,\"Test Capped\")>0,0,SUM(E26:E28))","v":{"$error":"#NAME?"}},null,{"$f":"IF(COUNTIF(G26:G39,\"Test Capped\")>0,0,SUM(G26:G28))","v":{"$error":"#NAME?"}}]
[]
[null,"REAR WHIPLASH",null,{"$f":"IF('General Overview'!C17=0,\"\",\"2ND ROW\")","v":""},null,{"$f":"IF('General Overview'!C18=0,\"\",\"3RD ROW\")","v":""}]
[null,null,"Effective Height"]
[null,null,"Lowest position - mm",null,{"$f":"IF(D44>720,\"PASS\",\"FAIL\")","v":"FAIL"},null,{"$f":"IF(F42=\"\",\"\",IF(F44>720,\"PASS\",\"FAIL\"))","v":""}]
[null,null,"Highest position - mm",null,{"$f":"IF(D45>770,\"PASS\",\"FAIL\")","v":"FAIL"},null,{"$f":"IF(F42=\"\",\"\",IF(F45>770,\"PASS\",\"FAIL\"))","v":""}]
[null,null,{"$f":"IF(OR(E45=\"Fail\",G45=\"Fail\"),\"<50mm from interior\",\"\")","v":"<50mm from interior"}]
[null,"Rear Effective Height assessment",null,{"$f":"(IF(OR(AND(E44=\"PASS\",E45=\"PASS\"),D46=\"Yes\"),1.5,0)+IF(OR(AND(G44=\"PASS\",G45=\"PASS\"),F46=\"Yes\"),1.5,0))/IF(F42=\"\",1,2)","v":0}]
[]
[null,null,"Backset requirements"]
[null,null,"Torso angle - deg"]
[null,null,"(ΔCP X) mid position- mm",null,{"$f":"IF(D51=\"\",0,IF(AND(E44=\"Pass\",OR(E45=\"Pass\",D46=\"Yes\"),D51<=(7.128*D50+153)),1/IF(F42=\"\",1,2),0))","v":0},null,{"$f":"IF(F42=\"\",\"\",IF(F51=\"\",0,IF(AND(G44=\"Pass\",OR(G45=\"Pass\",F46=\"Yes\"),F51<=(7.128*F50+153)),1/IF(F42=\"\",1,2),0)))","v":""}]
[null,null,"(ΔCP X) worst case position- mm",null,{"$f":"IF(D52=\"\",0,IF(AND(E44=\"Pass\",OR(E45=\"Pass\",D46=\"Yes\"),D52<=(7.128*D50+153)),0.5/IF(F42=\"\",1,2),0))","v":0},null,{"$f":"IF(F42=\"\",\"\",IF(F52=\"\",0,IF(AND(G44=\"Pass\",OR(G45=\"Pass\",F46=\"Yes\"),F52<=(7.128*F50+153)),0.5/IF(F42=\"\",1,2),0)))","v":""}]
[]
[null,"Rear Backset Assessment",null,{"$f":"SUM(E51,E52,G51,G52)","v":0}]
[]
[null,null,"Non-Use position",{"$f":"IF(OR(AND(E44=\"PASS\",E45=\"PASS\"),D46=\"Yes\",E51>0,E52>0),\"Eligible for scoring\",\"Not eligible for scoring\")","v":"Not eligible for scoring"},null,{"$f":"IF(OR(AND(G44=\"PASS\",G45=\"PASS\"),F46=\"Yes\",G51>0,G52>0),\"Eligible for scoring\",\"Not eligible for scoring\")","v":"Eligible for scoring"}]
[null,null,"Automatic return head restraints"]
[null,null,"60° rotation evaluation"]
[null,null,"10° torso line change"]
[null,null,"Discomfort metric"]
[]
[null,"Rear Non-Use Position Assessment",null,{"$f":"(IF(AND(D56=\"Eligible for scoring\",OR(COUNTIF(D57:D60,\"Pass\")>0,COUNTIF(D57:D60,\"Not applicable\")=4)),1,0)+IF(AND(F56=\"Eligible for scoring\",OR(COUNTIF(F57:F60,\"Pass\")>0,COUNTIF(F57:F60,\"Not applicable\")=4)),1,0))/IF(F42=\"\",1,2)","v":0}]
[]
[null,"Rear Whiplash assessment",null,{"$f":"SUM(D47,D54,D62)","v":0}]
[]
[null,"SUMMARY"]
[null,null,"Static assessment",{"$f":"D23","v":{"$error":"#NAME?"}}]
[null,null,"Dynamic assessment",{"$f":"SUM(D40:G40)","v":{"$error":"#NAME?"}}]
[null,null,"Dummy Artifact Loading (-2)",0]
[]
[null,"TOTAL FRONT WHIPLASH",null,{"$f":"ROUND(SUM(D67:G69)/8*3,Round)","v":{"$error":"#NAME?"}}]
[null,"TOTAL REAR WHIPLASH",null,{"$f":"ROUND(D64/4*1,Round)","v":0}]
[]
[null,"TOTAL WHIPLASH",null,{"$f":"IF(OR('General Overview'!C17=\"\",'General Overview'!C18=\"\",'General Overview'!C17>0,'General Overview'!C18>0),SUM(D71:G72),D71/3*4)","v":{"$error":"#NAME?"}}]
[]
[]
[]
[]
[]
[null,"DUMMY MEASUREMENTS"]
[null,"Head"]
[null,"Ax","Max"]
[null,null,"Min"]
[null,"Ay","Max"]
[null,null,"Min"]
[null,"Az","Max"]
[null,null,"Min"]
[null,"Vx","Max"]
[null,"HRCT","Start"]
[null,null,"End"]
[null,"Cervical Spine"]
[null,"Ax","Max"]
[null,null,"Min"]
[null,"Az","Max"]
[null,null,"Min"]
[null,"Neck Upper"]
[null,"Fx","Max"]
[null,null,"Min"]
[null,"Fy","Max"]
[null,null,"Min"]
[null,"Fz","Max"]
[null,null,"Min"]
[null,"Mx","Max"]
[null,null,"Min"]
[null,"My","Max"]
[null,null,"Min"]
[null,"Mz","Max"]
[null,null,"Min"]
[null,"Neck Lower"]
[null,"Fx","Max"]
[null,null,"Min"]
[null,"Fy","Max"]
[null,null,"Min"]
[null,"Fz","Max"]
[null,null,"Min"]
[null,"Mx","Max"]
[null,null,"Min"]
[null,"My","Max"]
[null,null,"Min"]
[null,"Mz","Max"]
[null,null,"Min"]
[null,"Thoracic Spine (left)"]
[null,"Ax","Max"]
[null,null,"Min"]
[null,"Az","Max"]
[null,null,"Min"]
[null,"Thoracic Spine (right)"]
[null,"Ax","Max"]
[null,null,"Min"]
[null,"Az","Max"]
[null,null,"Min"]
[null,"Thoracic Spine T8"]
[null,"Ax","Max"]
[null,null,"Min"]
[null,"Az","Max"]
[null,null,"Min"]
[null,"Lumbar Spine"]
[null,"Ax","Max"]
[null,null,"Min"]
[null,"Az","Max"]
[null,null,"Min"]
[null,"Pelvis"]
[null,"Ax","Max"]
[null,null,"Min"]
[null,"Ay","Max"]
[null,null,"Min"]
[null,"Az","Max"]
[null,null,"Min"]
[]
[null,"SLED MEASUREMENTS"]
[null,"Sled"]
[null,"Ax","Max"]
[null,null,"Min"]

{"sheet":"AOP Rescue","index":8,"n_rows":54,"n_cols":11,"rows_kept":54,"cut":false,"hidden":false,"merged":[[1,3,3,10],[36,3,36,10],[37,3,37,10],[38,7,38,10],[39,7,39,10],[17,3,17,10],[22,3,22,10],[27,3,27,10],[12,7,12,8],[12,9,12,10],[4,3,4,6],[5,3,5,6],[6,3,6,6],[7,3,7,6],[8,3,8,6],[12,5,12,6],[48,3,48,10],[49,3,49,10],[50,3,50,10],[51,3,51,10],[53,3,53,10],[12,3,12,4],[32,1,32,2],[41,3,41,10],[46,3,46,10],[43,3,43,6],[44,3,44,6],[45,3,45,6],[42,3,42,6],[42,7,45,10],[40,3,40,10],[38,3,38,6],[39,3,39,6],[32,3,32,10],[34,3,34,10],[33,1,33,10],[9,3,9,6],[10,3,10,10],[4,7,4,10],[5,7,5,10],[6,7,6,10],[7,7,7,10],[8,7,8,10],[9,7,9,10],[1,1,2,2],[3,1,3,2],[10,1,10,2],[46,1,46,2],[53,1,53,2],[34,1,34,2],[48,1,48,2],[17,1,17,2],[22,1,22,2],[27,1,27,2]]}
[]
[null,"Rescue, Extrication & Safety"]
[]
[null,{"$f":"'General Overview'!G14","v":""}]
[null,"RESCUE",null,"AVAILABILITY",null,null,null,"COMPLIANCE"]
[null,null,"Rescue sheet"]
[null,null,"English"]
[null,null,"German"]
[null,null,"French"]
[null,null,"Spanish"]
[null,"RESCUE ASSESSMENT",null,{"$f":"IF(COUNTIF(D7:G10,\"FAIL\")>0,-2,IF(COUNTIF(H7:K10,\"FAIL\")>0,-1,0))","v":0}]
[]
[null,"EXTRICATION",null,"MPDB",null,"FW",null,"AE-MDB",null,"POLE"]
[null,null,null,"Driver side","Passenger side","Driver side","Passenger side","Driver side","Passenger side","Driver side","Passenger side"]
[null,null,"Automatic Door Locking (if applicable)"]
[null,null,"Front"]
[null,null,"Rear"]
[null,"Automatic door locking assessment",null,{"$f":"IF(COUNTIF(D16:K17,\"FAIL\")>0,-1,0)","v":0}]
[null,null,null,"Driver side","Passenger side","Driver side","Passenger side","Driver side","Passenger side","Driver side","Passenger side"]
[null,null,"Door opening forces - N"]
[null,null,"Front"]
[null,null,"Rear"]
[null,"Door opening force assessment",null,{"$f":"IF(OR(COUNTIF(D21:K22,\">750\")>0,COUNTIF(D21:K22,\"Tools\")>0),-1,0)","v":0}]
[null,null,null,"Driver side","Passenger side","Driver side","Passenger side","Driver side","Passenger side","Driver side","Passenger side"]
[null,null,"Retracting door handles (if applicable)"]
[null,null,"Front"]
[null,null,"Rear"]
[null,"Retracting door handles assessment",null,{"$f":"IF(COUNTIF(D26:K27,\"FAIL\")>0,-1,0)","v":0}]
[null,null,null,"Driver side","Passenger side","Driver side","Passenger side","Driver side","Passenger side","Driver side","Passenger side"]
[null,null,"Seatbelt buckle unlatching - N"]
[null,null,"Front"]
[null,null,"Rear"]
[null,"Seatbelt buckle unlatching assessment",null,{"$f":"IF(COUNTIF(D31:G32,\">60\")>0,-1,0)","v":0}]
[]
[null,"EXTRICATION ASSESSMENT",null,{"$f":"MIN(D18,D23,D28,D33)","v":0}]
[]
[null,"POST-CRASH TECHNOLOGY"]
[null,null,"Advanced eCall"]
[null,null,"Potential # of occupants",null,null,null,null,{"$f":"IF(D39=\"PASS\",0.5,0)","v":0}]
[null,null,"Recent vehicle locations N1 & N2",null,null,null,null,{"$f":"IF(D40=\"PASS\",0.5,0)","v":0}]
[]
[null,null,"Multi Collision Brake"]
[null,null,"Name",null,null,null,null,{"$f":"IF(AND(D43<>\"\",D44=\"PASS\",D45=\"PASS\",D46=\"PASS\"),1,0)","v":0}]
[null,null,"Description in manual"]
[null,null,"Deceleration during activation"]
[null,null,"Brake light activation"]
[null,"POST-CRASH TECHNOLOGY ASSESSMENT",null,{"$f":"SUM(H39:K40,H43)","v":0}]
[]
[null,"SUMMARY"]
[null,null,"Rescue",{"$f":"D11","v":0}]
[null,null,"Extrication",{"$f":"D35","v":0}]
[null,null,"Post-crash technology",{"$f":"D47","v":0}]
[]
[null,"TOTAL RESCUE, EXTRICATION & SAFETY",null,{"$f":"IF(D50<0,D50,SUM(D50:K52))","v":0}]

{"sheet":"COP Dynamic","index":9,"n_rows":128,"n_cols":7,"rows_kept":128,"cut":false,"hidden":false,"merged":[[16,3,16,4],[16,5,16,6],[35,3,35,4],[35,5,35,6],[38,3,38,4],[38,5,38,6],[22,3,22,4],[23,3,23,4],[29,3,29,4],[22,5,22,6],[23,5,23,6],[29,5,29,6],[7,3,7,4],[7,5,7,6],[1,1,2,2],[1,3,2,4],[1,5,2,6],[3,1,3,2],[5,3,5,4],[5,5,5,6],[6,3,6,4],[6,5,6,6],[4,3,4,4],[4,5,4,6],[12,3,12,4],[12,5,12,6],[15,3,15,4],[15,5,15,6],[8,5,8,6],[8,3,8,4],[9,5,9,6],[9,3,9,4],[11,3,11,4],[11,5,11,6],[14,3,14,4],[14,5,14,6],[13,3,13,4],[13,5,13,6],[62,1,62,2],[21,1,21,2],[33,1,33,2],[33,3,33,4],[33,5,33,6],[42,1,42,2],[37,3,37,4],[37,5,37,6],[36,3,36,4],[36,5,36,6],[48,1,48,2],[48,3,48,4],[48,5,48,6],[56,1,56,2],[56,3,56,6],[50,1,50,2],[52,3,52,4],[52,5,52,6],[54,1,54,2],[54,3,54,4],[54,5,54,6],[27,1,27,2],[28,3,28,4],[28,5,28,6],[32,1,32,2],[51,3,51,4],[51,5,51,6],[43,3,43,4],[44,3,44,4],[43,5,43,6],[44,5,44,6],[46,3,46,4],[46,5,46,6]]}
[3]
[null,"Child Occupant Protection",null,"Q6",null,"Q10"]
[]
[null,{"$f":"_xlfn.CONCAT('General Overview'!G4, \" & \",'General Overview'!G6)","v":" & "},null,"Value","Points","Value","Points"]
[null,"CRS DETAILS"]
[null,null,"Child restraint"]
[null,null,"CRS make and model"]
[null,null,"Installation method"]
[null,null,"Type of CRS","Highback booster",null,"='General Overview'!G42"]
[null,null,"Recommended by vehicle manufacturer"]
[]
[null,"FRONTAL"]
[null,null,"Dummy restrained throughout impact?"]
[null,null,"Belt slipping of shoulder?"]
[null,null,"Submarining or upward movement in rebound?"]
[null,null,"CRS anchorage to vehicle failure?"]
[null,null,"Head"]
[null,null,"Hard contact"]
[null,null,"HIC15",null,{"$f":"IF(D18=\"Yes\",Sliding_Scale(D19,500,700,4*IF('General Overview'!C17=0,2,1),0),\"\")","v":""},null,{"$f":"IF(F18=\"Yes\",Sliding_Scale(F19,500,700,4,0),\"\")","v":""}]
[null,null,"Head Resultant 3msec - g",null,{"$f":"ROUND(Sliding_Scale(D20,60,80,4,0),Round)","v":{"$error":"#NAME?"}},null,{"$f":"ROUND(Sliding_Scale(F20,60,80,4,0),Round)","v":{"$error":"#NAME?"}}]
[null,null,"Head Excursion (-2/-4) - mm",null,{"$f":"IF(D21>=550,-4,0)","v":0},null,{"$f":"IF(F21>=550,-4,IF(F21>=450,-2,0))","v":0}]
[null,"Head assessment",null,null,{"$f":"MAX(MIN(E19:E20)+E21,0)","v":{"$error":"#NAME?"}},null,{"$f":"MAX(MIN(G19:G20)+G21,0)","v":{"$error":"#NAME?"}}]
[]
[null,null,"Upper Neck"]
[null,null,"Belt interaction?"]
[null,null,"Tension (Upper neck Fz)",null,{"$f":"ROUND(Sliding_Scale(D26,1.7,2.62,2,0),Round)","v":{"$error":"#NAME?"}},null,{"$f":"ROUND(Sliding_Scale(F26,1.7,2.62,2,0),Round)","v":{"$error":"#NAME?"}}]
[null,null,"Extension (My)",null,{"$f":"IF(D18=\"Yes\",IF(D27<36,2,0),\"\")","v":""},null,{"$f":"IF(F18=\"Yes\",IF(F27<49,2,0),\"\")","v":""}]
[null,"Upper Neck assessment",null,null,{"$f":"MAX(MIN(E26:E27),0)","v":{"$error":"#NAME?"}},null,{"$f":"MAX(MIN(G26:G27),0)","v":{"$error":"#NAME?"}}]
[]
[null,null,"Chest (T4)"]
[null,null,"Chest Resultant 3msec - g",null,null,null,{"$f":"ROUND(Sliding_Scale(F31,41,55,2,0),Round)","v":{"$error":"#NAME?"}}]
[null,null,"Chest Deflection - mm",null,{"$f":"ROUND(Sliding_Scale(D32,30,42,2,0),Round)","v":{"$error":"#NAME?"}}]
[null,"Chest assessment",null,null,{"$f":"E32","v":{"$error":"#NAME?"}},null,{"$f":"G31","v":{"$error":"#NAME?"}}]
[null,"Front assessment",null,{"$f":"IF(OR(D14=\"Yes\",D15=\"Yes\",D16=\"Yes\",D19>800,D20>80),0,MAX(SUM(E22,E28,E33)+IF(D14=\"Partial\",-4,0),0))","v":{"$error":"#NAME?"}},null,{"$f":"IF(OR(F14=\"Yes\",F15=\"Yes\",F16=\"Yes\",F19>800,F20>80),0,MAX(SUM(G22,G28,G33)+IF(F14=\"Partial\",-4,0),0))","v":{"$error":"#NAME?"}}]
[]
[null,"SIDE"]
[null,null,"Dummy restrained throughout impact?"]
[null,null,"CRS anchorage to vehicle failure?"]
[null,null,"Head"]
[null,null,"Bottoming out or contact with interior?"]
[null,null,"HIC15",null,{"$f":"IF(D40=\"Yes\",Sliding_Scale(D41,500,700,2,0),\"\")","v":""},null,{"$f":"IF(F40=\"Yes\",Sliding_Scale(F41,500,700,2,0),\"\")","v":""}]
[null,null,"Head Resultant 3msec - g",null,{"$f":"ROUND(Sliding_Scale(D42,60,80,2,0),Round)","v":{"$error":"#NAME?"}},null,{"$f":"ROUND(Sliding_Scale(F42,60,80,2,0),Round)","v":{"$error":"#NAME?"}}]
[null,"Head assessment",null,null,{"$f":"MAX(MIN(E41:E42),0)","v":{"$error":"#NAME?"}},null,{"$f":"MAX(MIN(G41:G42),0)","v":{"$error":"#NAME?"}}]
[]
[null,null,"Neck"]
[null,null,"Resultant Force (Upper neck)",null,{"$f":"IF(D46=\"\",0,IF(D46>=2.4,0,1))","v":0},null,{"$f":"IF(F46=\"\",0,IF(F46>=2.2,0,1))","v":0}]
[null,null,"Chest"]
[null,null,"Chest Resultant 3msec - g",null,{"$f":"IF(D48=\"\",0,IF(D48>=67,0,1))","v":0},null,{"$f":"IF(F48=\"\",0,IF(F48>=67,0,1))","v":0}]
[null,"Side assessment",null,{"$f":"IF(OR(D37=\"No\",D38=\"Yes\",D41>800,D42>80),0,SUM(E43,E46,E48))","v":{"$error":"#NAME?"}},null,{"$f":"IF(OR(F37=\"No\",F38=\"Yes\",F41>800,F42>80),0,SUM(G43,G46,G48))","v":{"$error":"#NAME?"}}]
[]
[null,"SUMMARY"]
[null,null,"Front assessment",{"$f":"D34","v":{"$error":"#NAME?"}},null,{"$f":"F34","v":{"$error":"#NAME?"}}]
[null,null,"Side assessment",{"$f":"D49","v":{"$error":"#NAME?"}},null,{"$f":"F49","v":{"$error":"#NAME?"}}]
[]
[null,"TOTAL",null,{"$f":"ROUND(SUM(D52:E53),Round)","v":{"$error":"#NAME?"}},null,{"$f":"ROUND(SUM(F52:G53),Round)","v":{"$error":"#NAME?"}}]
[]
[null,"TOTAL DYNAMIC ASSESSMENT",null,{"$f":"ROUND(SUM(D55:G55)*IF('General Overview'!C17=0,2,1),Round)","v":{"$error":"#NAME?"}}]
[]
[]
[]
[]
[]
[null,"DUMMY MEASUREMENTS",null,"Frontal","Side","Frontal","Side"]
[null,"Head"]
[null,"Ax","Max"]
[null,null,"Min"]
[null,"Ay","Max"]
[null,null,"Min"]
[null,"Az","Max"]
[null,null,"Min"]
[null,"Neck"]
[null,"Fx","Max"]
[null,null,"Min"]
[null,"Fy","Max"]
[null,null,"Min"]
[null,"Fz","Max"]
[null,null,"Min"]
[null,"Mx","Max"]
[null,null,"Min"]
[null,"My","Max"]
[null,null,"Min"]
[null,"Mz","Max"]
[null,null,"Min"]
[null,"Shoulder"]
[null,"Fx","Max"]
[null,null,"Min"]
[null,"Fy","Max"]
[null,null,"Min"]
[null,"Fz","Max"]
[null,null,"Min"]
[null,"T1"]
[null,"Ay","Max"]
[null,"Chest"]
[null,"Ax","Max"]
[null,null,"Min"]
[null,"Ay","Max"]
[null,null,"Min"]
[null,"Az","Max"]
[null,null,"Min"]
[null,"Dchest","Max"]
[null,null,"Min"]
[null,"LO","Max"]
[null,null,"Min"]
[null,"UP","Max"]
[null,null,"Min"]
[null,"Lumbar Spine (lower)"]
[null,"Fx","Max"]
[null,null,"Min"]
[null,"Fy","Max"]
[null,null,"Min"]
[null,"Fz","Max"]
[null,null,"Min"]
[null,"Mx","Max"]
[null,null,"Min"]
[null,"My","Max"]
[null,null,"Min"]
[null,"Mz","Max"]
[null,null,"Min"]
[null,"Pelvis-Sacrum"]
[null,"Ax","Max"]
[null,null,"Min"]
[null,"Ay","Max"]
[null,null,"Min"]
[null,"Az","Max"]
[null,null,"Min"]
[null,"Pelvis-Pubis"]
[null,"Fy","Max"]
[null,null,"Min"]

{"sheet":"COP Vehicle Based","index":10,"n_rows":53,"n_cols":10,"rows_kept":53,"cut":false,"hidden":false,"merged":[[46,7,47,7],[49,1,49,2],[50,1,50,2],[51,1,51,2],[52,1,52,2],[46,1,47,2],[46,3,47,3],[46,4,47,4],[46,5,47,5],[46,6,47,6],[1,1,2,2],[1,3,2,3],[1,4,2,6],[1,7,2,9],[3,1,3,2],[11,1,11,2],[15,1,15,2],[8,3,8,9],[9,3,9,9],[10,3,10,9],[11,3,11,9],[15,3,15,9],[21,1,21,2],[25,1,25,2],[20,3,20,9],[21,3,21,9],[25,3,25,9],[30,1,30,2],[34,1,34,2],[36,1,36,2],[30,3,30,9],[34,3,34,9],[36,3,36,9]]}
[]
[null,"Vehicle based assessment",null,"Front","2nd row",null,null,"3rd row"]
[]
[null,null,null,"Passenger","Left","Centre","Right","Left","Centre","Right"]
[null,"SEATING POSITIONS"]
[null,null,"Provision of three-point seat belts  "]
[]
[null,"VEHICLE HANDBOOK INFORMATION"]
[null,null,"Universal (belted) table"]
[null,null,"ISOFIX table"]
[null,null,"i-Size table"]
[null,"Eligibility for scoring",null,{"$f":"IF(AND(COUNTIF(D6:J6,\"Yes\")=(1+SUM('General Overview'!C17:D18)),COUNTIF(D9:D11,\"OK\")=3),\"Yes\",\"No\")","v":"No"}]
[]
[null,"GABARIT INSTALLATION"]
[null,null,"Gabarit installation","Pass"]
[null,"Gabarit installation score",null,{"$f":"IF(AND(E15=\"Pass\",G15=\"Pass\"),1,0)+IF(COUNTIF(D15:J15,\"Pass\")=(1+SUM('General Overview'!C17:D18)),IF(COUNTIF(D15:J15,\"Pass\")=1,2,1),0)","v":2}]
[]
[null,"i-SIZE AND TOP TETHER MARKING"]
[null,null,"i-Size marking requirements"]
[null,null,"i-Size availabilty (ISO/B2 i-Size fixture)"]
[null,null,"Simultaneously covering i-Size",{"$f":"IF(COUNTIF(D19:J19,\"Pass\")>=3*IF('General Overview'!C17+'General Overview'!C18=0,1/3,1),\"Pass\",\"Fail\")","v":"Fail"}]
[null,"i-Size and top tether marking score",null,{"$f":"IF(AND(COUNTIF(D19:J19,\"Pass\")>=2*IF('General Overview'!C17+'General Overview'!C18=0,0.5,1),COUNTIF(D20:J20,\"Pass\")>=2*IF('General Overview'!C17+'General Overview'!C18=0,0.5,1)),2,0)+IF(D21=\"Pass\",1,0)","v":0}]
[]
[null,"TWO OR MORE LARGEST ISOFIX POSITIONS"]
[null,null,"Ability to install ISO/R3"]
[null,"Two or more largest ISOFIX positions score",null,{"$f":"IF(COUNTIF(D25:J25,\"Pass\")>=2*IF('General Overview'!C17+'General Overview'!C18=0,0.5,1),1,0)","v":0}]
[]
[null,"PASSENGER AIRBAG WARNING MARKING AND DISABLING"]
[null,null,"Manual airbag disabling switch"]
[null,null,"Automatic airbag disabling switch"]
[null,"Passenger airbag warning marking and disabling score",null,{"$f":"IF(D30=\"Pass\",4,IF(D29=\"Pass\",2,0))","v":0}]
[]
[null,"INTEGRATED CRS"]
[null,null,"Integrated CRS"]
[null,"Integrated CRS scoring",null,{"$f":"IF(COUNTIF(D34:J34,\"Yes\")>=2*IF('General Overview'!C17+'General Overview'!C18=0,0.5,1),3,IF(COUNTIF(D34:J34,\"Yes\")>=1,1,0))","v":0}]
[]
[null,"TOTAL VEHICLE BASED ASSESSMENT",null,{"$f":"IF(D12=\"Yes\",SUM(D16,D22,D26,D31,D35),0)","v":0}]
[]
[]
[]
[]
[]
[]
[]
[]
[]
[null,"Website table",null,"Front Passenger","2nd row Outboard","2nd row Centre","3rd row Outboard","3rd row Centre"]
[]
[]
[null,null,null,"Value","Value","Value","Value","Value"]
[null,"ISOFIX"]
[null,"iSize"]
[null,"Integrated CRS"]

{"sheet":"COP CRS Installation","index":11,"n_rows":28,"n_cols":20,"rows_kept":28,"cut":false,"hidden":false,"merged":[[1,1,3,6],[1,7,1,15],[1,16,2,19],[2,7,2,9],[2,10,2,12],[2,13,2,15],[4,3,4,4],[5,1,8,1],[5,2,6,2],[5,3,5,4],[6,3,6,4],[7,3,7,4],[8,3,8,4],[9,1,10,1],[9,3,9,4],[10,3,10,4],[11,1,15,1],[11,3,12,4],[11,5,12,5],[11,6,12,6],[15,3,15,4],[13,3,13,4],[14,3,14,4],[17,3,17,4],[18,3,18,4],[19,3,19,4],[21,1,21,6],[21,7,21,19],[16,1,19,1],[16,3,16,4],[16,16,17,18],[16,19,18,19],[25,2,25,6],[25,7,25,19],[27,1,27,6],[27,7,27,19],[22,2,22,6],[22,7,22,19],[23,2,23,6],[23,7,23,19],[24,2,24,6],[24,7,24,19]]}
[]
[null,"CRS Installation Assessment",null,null,null,null,null,"SEATING POSITION",null,null,null,null,null,null,null,null,"SCORING"]
[null,null,null,null,null,null,null,"Front",null,null,"2nd row",null,null,{"$f":"IF(OR('General Overview'!C18>1,'General Overview'!C18=\"\"),\"3rd row\",\"3rd\")","v":"3rd row"}]
[null,null,null,null,null,null,null,"Left","Centre","Right","Left","Centre","Right","Left","Centre","Right","Pass","Fail","Exempt","Score"]
[]
[null,"UNIVERSAL","Group 0+","Maxi Cosi Cabriofix",null,"B _ _ _","U",null,null,null,null,null,null,null,null,null,{"$f":"COUNTIF($H6:$P6,\"Pass\")","v":0},{"$f":"COUNTIF($H6:$P6,\"Fail\")+COUNTIF($H6:$P6,\"P Fail\")","v":0},null,{"$f":"IF(SUM(Q6:S6)=0,\"\",Q6/(Q6+R6))","v":""}]
[null,null,null,"Maxi Cosi Cabriofix & EasyFix",null,"B _ L _","VEHICLE LIST",null,null,null,null,null,null,null,null,null,0,0,{"$f":"COUNTIF($H7:$P7,\"Exempt\")","v":0},{"$f":"IF(SUM(Q7:S7)=0,\"\",(Q7+S7)/(Q7+R7+S7))","v":""}]
[null,null,"Group I","Britax Römer King II LS",null,"B _ _ _","U / UF",null,null,null,null,null,null,null,null,null,0,0,null,{"$f":"IF(SUM(Q8:S8)=0,\"\",Q8/(Q8+R8))","v":""}]
[null,null,"Group II/III","Cybex Solution Z i-Fix",null,"B _ _ _","U / UF",null,null,null,null,null,null,null,null,null,0,0,null,{"$f":"IF(SUM(Q9:S9)=0,\"\",Q9/(Q9+R9))","v":""}]
[null,"ISOFIX","Group 0+/I","BeSafe iZi Combi X4 ISOfix",null,"_ I L _","ISO/R3",null,null,null,null,null,null,null,null,null,0,0,{"$f":"COUNTIF($H10:$P10,\"Exempt\")","v":0},{"$f":"IF(SUM(Q10:S10)=0,\"\",(Q10+S10)/(Q10+R10+S10))","v":""}]
[null,null,"Group II/III","Cybex Solution Z i-Fix",null,"B I _ _","VEHICLE LIST",null,null,null,null,null,null,null,null,null,0,0,null,{"$f":"IF(SUM(Q11:S11)=0,\"\",Q11/(Q11+R11))","v":""}]
[null,"i-Size","67-105cm","Maxi Cosi 2way Pearl & 2wayFix",null,"_ I L _","i-Size",null,null,null,null,null,null,null,null,null,0,0,null,""]
[null,null,">15m-105cm",null,null,null,null,null,null,null,null,null,null,null,null,null,0,0,null,""]
[null,null,"61-105cm","BeSafe iZi Kid X2 i-Size",null,"_ I L _","i-Size",null,null,null,null,null,null,null,null,null,0,0,null,""]
[null,null,"76-105cm","Britax Römer TriFix2 i-Size",null,"_ I L _","i-Size",null,null,null,null,null,null,null,null,null,0,0,null,{"$f":"IF(SUM(Q15:S15)=0,\"\",Q15/(Q15+R15))","v":""}]
[null,null,"100-135cm","BeSafe iZi Flex FIX i-Size",null,"B I _ _","i-Size",null,null,null,null,null,null,null,null,null,0,0,null,""]
[null,"OEM","Group 0+",null,null,null,null,null,null,null,null,null,null,null,null,null,null,null,null,{"$f":"IF('General Overview'!C17=0,IF(AND(COUNTIF(F17:G19,\"\")=0,Q19=1),1,0),IF(AND(COUNTIF(F17:G19,\"\")=0,Q19=2),1,0))","v":0}]
[null,null,"Group I"]
[null,null,"Group II",null,null,null,null,null,null,null,null,null,null,null,null,null,0,{"$f":"COUNTIF($H19:$P19,\"Fail\")+COUNTIF($H19:$P19,\"P Fail\")","v":0}]
[null,null,"Group III",null,null,null,null,null,null,null,null,null,null,null,null,null,0,{"$f":"COUNTIF($H20:$P20,\"Fail\")+COUNTIF($H20:$P20,\"P Fail\")","v":0},null,{"$f":"IF('General Overview'!C17=0,IF(Q20=1,1,0),IF(Q20=2,1,0))","v":0}]
[]
[null,"SUMMARY"]
[null,null,"Universal assessment",null,null,null,null,{"$f":"IF(COUNTIF(T6:T9,\"\")>0,0,AVERAGE(T6:T9)*4)","v":0}]
[null,null,"ISOFIX assessment",null,null,null,null,{"$f":"IF(COUNTIF(T10:T11,\"\")>0,0,AVERAGE(T10:T11)*2)","v":0}]
[null,null,"i-Size assessment",null,null,null,null,{"$f":"IF(COUNTIF(T12:T16,\"\")>0,0,AVERAGE(T12:T16)*4)","v":0}]
[null,null,"OEM assessment",null,null,null,null,{"$f":"T17+T20","v":0}]
[]
[null,"TOTAL INSTALLATION ASSESSMENT",null,null,null,null,null,{"$f":"SUM(H23:T26)","v":0}]

{"sheet":"VRU Headform","index":12,"n_rows":68,"n_cols":26,"rows_kept":68,"cut":false,"hidden":false,"merged":[[62,1,62,2],[62,3,62,18],[62,19,62,24],[65,1,65,18],[65,19,65,24],[67,1,67,18],[67,19,67,24],[63,1,63,2],[63,3,63,18],[63,19,63,24],[64,1,64,2],[64,3,64,18],[64,19,64,24],[58,1,58,18],[58,19,58,24],[60,1,60,18],[60,19,60,24],[57,1,57,2],[57,3,57,5],[57,6,57,8],[57,9,57,11],[61,1,61,2],[61,3,61,18],[61,19,61,24],[56,19,56,21],[56,22,56,24],[55,1,55,2],[55,3,55,5],[55,6,55,8],[55,9,55,11],[55,13,55,15],[55,16,55,18],[57,13,57,15],[57,16,57,18],[55,19,55,21],[55,22,55,24],[56,1,56,2],[56,3,56,5],[56,6,56,8],[56,9,56,11],[56,13,56,15],[56,16,56,18],[57,19,57,21],[57,22,57,24],[53,1,53,2],[53,3,53,5],[53,6,53,8],[53,9,53,11],[53,13,53,15],[53,16,53,18],[53,19,53,21],[53,22,53,24],[54,1,54,2],[54,3,54,5],[54,6,54,8],[54,9,54,11],[54,13,54,15],[54,16,54,18],[54,19,54,21],[54,22,54,24],[51,1,51,2],[51,3,51,5],[51,6,51,8],[51,9,51,11],[51,13,51,15],[51,16,51,18],[51,19,51,21],[51,22,51,24],[52,1,52,2],[52,3,52,5],[52,6,52,8],[52,9,52,11],[52,13,52,15],[52,16,52,18],[52,19,52,21],[52,22,52,24],[49,1,49,2],[49,3,49,5],[49,6,49,8],[49,9,49,11],[49,13,49,15],[49,16,49,18],[49,19,49,21],[49,22,49,24],[50,1,50,2],[50,3,50,5],[50,6,50,8],[50,9,50,11],[50,13,50,15],[50,16,50,18],[50,19,50,21],[50,22,50,24],[47,1,47,24],[48,1,48,2],[48,3,48,5],[48,6,48,8],[48,9,48,11],[48,13,48,15],[48,16,48,18],[48,19,48,21],[48,22,48,24],[43,1,43,2],[43,3,43,5],[43,6,43,8],[43,9,43,11],[43,13,43,15],[43,16,43,18],[43,19,43,21],[43,22,43,24],[45,1,45,18],[45,19,45,24],[41,1,41,2],[41,3,41,5],[41,6,41,8],[41,9,41,11],[41,13,41,15],[41,16,41,18],[41,19,41,21],[41,22,41,24],[42,1,42,2],[42,3,42,5],[42,6,42,8],[42,9,42,11],[42,13,42,15],[42,16,42,18],[42,19,42,21],[42,22,42,24],[39,1,39,2],[39,3,39,5],[39,6,39,8],[39,9,39,11],[39,13,39,15],[39,16,39,18],[39,19,39,21],[39,22,39,24],[40,1,40,2],[40,3,40,5],[40,6,40,8],[40,9,40,11],[40,13,40,15],[40,16,40,18],[40,19,40,21],[40,22,40,24],[37,1,37,2],[37,3,37,5],[37,6,37,8],[37,9,37,11],[37,13,37,15],[37,16,37,18],[37,19,37,21],[37,22,37,24],[38,1,38,2],[38,3,38,5],[38,6,38,8],[38,9,38,11],[38,13,38,15],[38,16,38,18],[38,19,38,21],[38,22,38,24],[35,1,35,2],[35,3,35,5],[35,6,35,8],[35,9,35,11],[35,13,35,15],[35,16,35,18],[35,19,35,21],[35,22,35,24],[36,1,36,2],[36,3,36,5],[36,6,36,8],[36,9,36,11],[36,13,36,15],[36,16,36,18],[36,19,36,21],[36,22,36,24],[33,1,33,2],[33,3,33,5],[33,6,33,8],[33,9,33,11],[33,13,33,15],[33,16,33,18],[33,19,33,21],[33,22,33,24],[34,1,34,2],[34,3,34,5],[34,6,34,8],[34,9,34,11],[34,13,34,15],[34,16,34,18],[34,19,34,21],[34,22,34,24],[31,1,31,24],[32,1,32,2],[32,3,32,5],[32,6,32,8],[32,9,32,11],[32,13,32,15],[32,16,32,18],[32,19,32,21],[32,22,32,24],[28,1,28,3],[28,4,28,15],[28,16,28,18],[28,19,28,21],[28,22,28,24],[29,1,29,15],[29,16,29,18],[29,19,29,21],[29,22,29,24],[26,1,26,3],[26,4,26,15],[26,16,26,18],[26,19,26,21],[26,22,26,24],[27,1,27,3],[27,4,27,15],[27,16,27,18],[27,19,27,21],[27,22,27,24],[24,1,24,3],[24,4,24,15],[24,16,24,18],[24,19,24,21],[24,22,24,24],[25,1,25,3],[25,4,25,15],[25,16,25,18],[25,19,25,21],[25,22,25,24],[22,1,22,3],[22,4,22,15],[22,16,22,18],[22,19,22,21],[22,22,22,24],[23,1,23,3],[23,4,23,15],[23,16,23,18],[23,19,23,21],[23,22,23,24],[1,1,2,24],[3,1,3,3],[4,1,18,1],[20,1,20,3],[20,4,20,15],[20,16,20,18],[20,19,20,21],[20,22,20,24],[21,1,21,3],[21,4,21,15],[21,16,21,18],[21,19,21,21],[21,22,21,24]]}
[]
[null,"Pedestrian Headforms"]
[]
[null,null,null,null,10,9,8,7,6,5,4,3,2,1,0,-1,-2,-3,-4,-5,-6,-7,-8,-9,-10]
[null,"WAD on Centreline",2400,14]
[null,null,2300,13]
[null,null,2200,12]
[null,null,2100,11]
[null,null,2000,10]
[null,null,1900,9]
[null,null,1800,8]
[null,null,1700,7]
[null,null,1600,6]
[null,null,1500,5]
[null,null,1400,4]
[null,null,1300,3]
[null,null,1200,2]
[null,null,1100,1]
[null,null,1000,0]
[]
[null,"PREDICTION",null,null,null,null,null,null,null,null,null,null,null,null,null,null,"Nr of points",null,null,"Points",null,null,"%-age"]
[null,null,null,null,"Default green",null,null,null,null,null,null,null,null,null,null,null,{"$f":"COUNTIF($E$5:$Y$19,\"D Green\")","v":0},null,null,{"$f":"Q22*1","v":0},null,null,{"$f":"IF(COUNTBLANK(E5:Y19)>0,\"\",Q22/$Q$30)","v":""}]
[null,null,null,null,"Green",null,null,null,null,null,null,null,null,null,null,null,{"$f":"COUNTIF($E$5:$Y$19,\"Green\")","v":0},null,null,{"$f":"Q23*1","v":0},null,null,{"$f":"IF(COUNTBLANK(E5:Y19)>0,\"\",Q23/$Q$30)","v":""}]
[null,null,null,null,"Yellow",null,null,null,null,null,null,null,null,null,null,null,{"$f":"COUNTIF($E$5:$Y$19,\"Yellow\")","v":0},null,null,{"$f":"Q24*0.75","v":0},null,null,{"$f":"IF(COUNTBLANK(E5:Y19)>0,\"\",Q24/$Q$30)","v":""}]
[null,null,null,null,"Orange",null,null,null,null,null,null,null,null,null,null,null,{"$f":"COUNTIF($E$5:$Y$19,\"Orange\")","v":0},null,null,{"$f":"Q25*0.5","v":0},null,null,{"$f":"IF(COUNTBLANK(E5:Y19)>0,\"\",Q25/$Q$30)","v":""}]
[null,null,null,null,"Brown",null,null,null,null,null,null,null,null,null,null,null,{"$f":"COUNTIF($E$5:$Y$19,\"Brown\")","v":0},null,null,{"$f":"Q26*0.25","v":0},null,null,{"$f":"IF(COUNTBLANK(E5:Y19)>0,\"\",Q26/$Q$30)","v":""}]
[null,null,null,null,"Red",null,null,null,null,null,null,null,null,null,null,null,{"$f":"COUNTIF($E$5:$Y$19,\"Red\")","v":0},null,null,{"$f":"Q27*0","v":0},null,null,{"$f":"IF(COUNTBLANK(E5:Y19)>0,\"\",Q27/$Q$30)","v":""}]
[null,null,null,null,"Default Red",null,null,null,null,null,null,null,null,null,null,null,{"$f":"COUNTIF($E$5:$Y$19,\"D Red\")","v":0},null,null,{"$f":"Q28*0","v":0},null,null,{"$f":"IF(COUNTBLANK(E5:Y19)>0,\"\",Q28/$Q$30)","v":""}]
[null,null,null,null,"Blue",null,null,null,null,null,null,null,null,null,null,null,{"$f":"COUNTIF($E$5:$Y$19,\"Blue\")","v":0},null,null,null,null,null,{"$f":"IF(COUNTBLANK(E5:Y19)>0,\"\",Q29/$Q$30)","v":""}]
[null,"Predicted headform score (excluding blue points)",null,null,null,null,null,null,null,null,null,null,null,null,null,null,{"$f":"SUM(Q22:S29)","v":0},null,null,{"$f":"SUM(T22:V28)","v":0},null,null,{"$f":"SUM(W22:Y29)","v":0}]
[]
[null,"VERIFICATION"]
[null,"Testpoint",null,"Prediction",null,null,"Value",null,null,"Points",null,null,null,"Testpoint",null,null,"Prediction",null,null,"Value",null,null,"Points"]
[null,null,null,null,null,null,null,null,null,{"$f":"IF(G34=\"\",\"\",actual_score(G34,D34))","v":""},null,null,null,null,null,null,null,null,null,null,null,null,{"$f":"IF(T34=\"\",\"\",actual_score(T34,Q34))","v":""}]
[null,null,null,null,null,null,null,null,null,{"$f":"IF(G35=\"\",\"\",actual_score(G35,D35))","v":""},null,null,null,null,null,null,null,null,null,null,null,null,""]
[null,null,null,null,null,null,null,null,null,"",null,null,null,null,null,null,null,null,null,null,null,null,""]
[null,null,null,null,null,null,null,null,null,"",null,null,null,null,null,null,null,null,null,null,null,null,""]
[null,null,null,null,null,null,null,null,null,"",null,null,null,null,null,null,null,null,null,null,null,null,""]
[null,null,null,null,null,null,null,null,null,"",null,null,null,null,null,null,null,null,null,null,null,null,""]
[null,null,null,null,null,null,null,null,null,"",null,null,null,null,null,null,null,null,null,null,null,null,""]
[null,null,null,null,null,null,null,null,null,"",null,null,null,null,null,null,null,null,null,null,null,null,""]
[null,null,null,null,null,null,null,null,null,"",null,null,null,null,null,null,null,null,null,null,null,null,""]
[null,null,null,null,null,null,null,null,null,"",null,null,null,null,null,null,null,null,null,null,null,null,""]
[null,"Total",null,{"$f":"(COUNTIF(D34:F43,\"Green\")*1)+(COUNTIF(D34:F43,\"Yellow\")*0.75)+(COUNTIF(D34:F43,\"Orange\")*0.5)+(COUNTIF(D34:F43,\"Brown\")*0.25)","v":0},null,null,null,null,null,{"$f":"SUM(J34:L43)","v":0},null,null,null,"Total",null,null,{"$f":"(COUNTIF(Q34:S43,\"Green\")*1)+(COUNTIF(Q34:S43,\"Yellow\")*0.75)+(COUNTIF(Q34:S43,\"Orange\")*0.5)+(COUNTIF(Q34:S43,\"Brown\")*0.25)","v":0},null,null,null,null,null,{"$f":"SUM(W34:Y43)","v":0}]
[]
[null,"Correction factor",null,null,null,null,null,null,null,null,null,null,null,null,null,null,null,null,null,{"$f":"ROUND(IF((J44+W44)=0,1,(J44+W44)/(D44+Q44)),Round)","v":1}]
[]
[null,"BLUE POINTS"]
[null,"Zone",null,"GRID-point",null,null,"Value",null,null,"Points",null,null,null,"Zone",null,null,"GRID-point",null,null,"Value",null,null,"Points"]
[null,1,null,null,null,null,null,null,null,{"$f":"IF(G50=\"\",\"\",IF(G50<=650,1,IF(G50<=1000,0.75,IF(G50<=1350,0.5,IF(G50<=1700,0.25,0)))))","v":""},null,null,null,5,null,null,null,null,null,null,null,null,{"$f":"IF(T50=\"\",\"\",IF(T50<=650,1,IF(T50<=1000,0.75,IF(T50<=1350,0.5,IF(T50<=1700,0.25,0)))))","v":""}]
[null,null,null,null,null,null,null,null,null,{"$f":"IF(D51=\"\",\"\",IF(G50<=650,1,IF(G50<=1000,0.75,IF(G50<=1350,0.5,IF(G50<=1700,0.25,0)))))","v":""},null,null,null,null,null,null,null,null,null,null,null,null,{"$f":"IF(Q51=\"\",\"\",IF(T50<=650,1,IF(T50<=1000,0.75,IF(T50<=1350,0.5,IF(T50<=1700,0.25,0)))))","v":""}]
[null,2,null,null,null,null,null,null,null,{"$f":"IF(G52=\"\",\"\",IF(G52<=650,1,IF(G52<=1000,0.75,IF(G52<=1350,0.5,IF(G52<=1700,0.25,0)))))","v":""},null,null,null,6,null,null,null,null,null,null,null,null,{"$f":"IF(T52=\"\",\"\",IF(T52<=650,1,IF(T52<=1000,0.75,IF(T52<=1350,0.5,IF(T52<=1700,0.25,0)))))","v":""}]
[null,null,null,null,null,null,null,null,null,{"$f":"IF(D53=\"\",\"\",IF(G52<=650,1,IF(G52<=1000,0.75,IF(G52<=1350,0.5,IF(G52<=1700,0.25,0)))))","v":""},null,null,null,null,null,null,null,null,null,null,null,null,{"$f":"IF(Q53=\"\",\"\",IF(T52<=650,1,IF(T52<=1000,0.75,IF(T52<=1350,0.5,IF(T52<=1700,0.25,0)))))","v":""}]
[null,3,null,null,null,null,null,null,null,{"$f":"IF(G54=\"\",\"\",IF(G54<=650,1,IF(G54<=1000,0.75,IF(G54<=1350,0.5,IF(G54<=1700,0.25,0)))))","v":""},null,null,null,7,null,null,null,null,null,null,null,null,{"$f":"IF(T54=\"\",\"\",IF(T54<=650,1,IF(T54<=1000,0.75,IF(T54<=1350,0.5,IF(T54<=1700,0.25,0)))))","v":""}]
[null,null,null,null,null,null,null,null,null,{"$f":"IF(D55=\"\",\"\",IF(G54<=650,1,IF(G54<=1000,0.75,IF(G54<=1350,0.5,IF(G54<=1700,0.25,0)))))","v":""},null,null,null,null,null,null,null,null,null,null,null,null,{"$f":"IF(Q55=\"\",\"\",IF(T54<=650,1,IF(T54<=1000,0.75,IF(T54<=1350,0.5,IF(T54<=1700,0.25,0)))))","v":""}]
[null,4,null,null,null,null,null,null,null,{"$f":"IF(G56=\"\",\"\",IF(G56<=650,1,IF(G56<=1000,0.75,IF(G56<=1350,0.5,IF(G56<=1700,0.25,0)))))","v":""},null,null,null,8,null,null,null,null,null,null,null,null,{"$f":"IF(T56=\"\",\"\",IF(T56<=650,1,IF(T56<=1000,0.75,IF(T56<=1350,0.5,IF(T56<=1700,0.25,0)))))","v":""}]
[null,null,null,null,null,null,null,null,null,{"$f":"IF(D57=\"\",\"\",IF(G56<=650,1,IF(G56<=1000,0.75,IF(G56<=1350,0.5,IF(G56<=1700,0.25,0)))))","v":""},null,null,null,null,null,null,null,null,null,null,null,null,{"$f":"IF(Q57=\"\",\"\",IF(T56<=650,1,IF(T56<=1000,0.75,IF(T56<=1350,0.5,IF(T56<=1700,0.25,0)))))","v":""}]
[]
[null,"Total blue points",null,null,null,null,null,null,null,null,null,null,null,null,null,null,null,null,null,{"$f":"SUM(J50:L57,W50:Y57)","v":0}]
[]
[null,"SUMMARY"]
[null,null,null,"Predicted score (excluding blue points)",null,null,null,null,null,null,null,null,null,null,null,null,null,null,null,{"$f":"T30","v":0}]
[null,null,null,"Default Green",null,null,null,null,null,null,null,null,null,null,null,null,null,null,null,{"$f":"T22","v":0}]
[null,null,null,"Blue points score",null,null,null,null,null,null,null,null,null,null,null,null,null,null,null,{"$f":"T59","v":0}]
[null,null,null,"Correction factor",null,null,null,null,null,null,null,null,null,null,null,null,null,null,null,{"$f":"T46","v":1}]
[null,"Total score",null,null,null,null,null,null,null,null,null,null,null,null,null,null,null,null,null,{"$f":"IF(T65=\"\",\"\",ROUND((T62-T63)*T65+T63+T64,Round))","v":0}]
[]
[null,"TOTAL PEDESTRIAN HEADFORM",null,null,null,null,null,null,null,null,null,null,null,null,null,null,null,null,null,{"$f":"IF(COUNTBLANK(E5:Y19)>0,0,ROUND(T66/Q30*24,Round))","v":0},null,null,null,null,null,{"$f":"ROUND(T68,1)","v":0}]

{"sheet":"VRU Upper Legform","index":13,"n_rows":35,"n_cols":28,"rows_kept":35,"cut":false,"hidden":false,"merged":[[8,24,8,25],[20,20,20,21],[21,20,21,21],[22,20,22,21],[23,20,23,21],[21,18,21,19],[22,18,22,19],[11,24,11,25],[13,24,13,25],[10,24,10,25],[27,20,27,21],[3,18,3,19],[7,18,7,19],[8,18,8,19],[9,18,9,19],[10,18,10,19],[11,18,11,19],[27,18,27,19],[24,18,24,19],[26,18,26,19],[25,18,25,19],[14,18,14,19],[15,18,15,19],[16,18,16,19],[17,18,17,19],[18,18,18,19],[19,18,19,19],[20,18,20,19],[6,20,6,21],[6,18,6,19],[4,18,4,19],[5,18,5,19],[23,18,23,19],[12,18,12,19],[27,22,27,23],[6,4,6,5],[7,4,7,5],[8,4,8,5],[9,4,9,5],[10,4,10,5],[11,4,11,5],[12,4,12,5],[13,4,13,5],[14,4,14,5],[16,4,16,5],[17,4,17,5],[18,4,18,5],[19,4,19,5],[20,4,20,5],[21,4,21,5],[22,4,22,5],[23,4,23,5],[24,4,24,5],[18,22,18,23],[19,22,19,23],[25,4,25,5],[26,4,26,5],[27,4,27,5],[1,1,2,5],[3,1,3,5],[4,1,4,5],[15,4,15,5],[6,1,6,2],[2,6,2,9],[11,6,11,7],[7,8,7,9],[8,8,8,9],[9,8,9,9],[5,1,5,5],[13,6,13,7],[14,6,14,7],[15,6,15,7],[10,8,10,9],[1,6,1,17],[2,10,2,13],[4,10,4,13],[14,8,14,9],[15,8,15,9],[3,8,3,9],[13,16,13,17],[2,14,2,17],[5,14,5,17],[24,22,24,23],[25,22,25,23],[26,22,26,23],[8,20,8,21],[9,20,9,21],[10,20,10,21],[11,20,11,21],[12,20,12,21],[13,20,13,21],[24,20,24,21],[25,20,25,21],[14,20,14,21],[15,20,15,21],[16,20,16,21],[17,20,17,21],[18,20,18,21],[19,20,19,21],[26,20,26,21],[22,22,22,23],[23,22,23,23],[20,22,20,23],[10,22,10,23],[11,22,11,23],[7,10,7,11],[3,14,3,15],[7,14,7,15],[3,20,3,21],[7,20,7,21],[26,8,26,9],[22,8,22,9],[24,16,24,17],[23,8,23,9],[24,8,24,9],[25,8,25,9],[23,16,23,17],[3,16,3,17],[5,10,5,13],[13,18,13,19],[9,12,9,13],[10,12,10,13],[11,16,11,17],[12,8,12,9],[13,8,13,9],[3,22,3,23],[7,24,7,25],[4,14,4,17],[2,18,2,19],[2,20,2,21],[5,20,5,21],[4,20,4,21],[2,22,2,25],[5,22,5,25],[7,22,7,23],[3,6,3,7],[3,10,3,11],[8,10,8,11],[8,16,8,17],[3,24,3,25],[4,22,4,25],[11,8,11,9],[9,16,9,17],[9,24,9,25],[8,22,8,23],[9,22,9,23],[4,6,4,9],[6,6,6,9],[5,6,5,9],[7,6,7,7],[9,10,9,11],[10,10,10,11],[7,16,7,17],[10,16,10,17],[6,10,6,13],[6,14,6,17],[8,12,8,13],[6,22,6,25],[3,12,3,13],[11,26,11,27],[12,26,12,27],[13,26,13,27],[14,26,14,27],[11,12,11,13],[12,12,12,13],[13,12,13,13],[14,12,14,13],[13,10,13,11],[13,22,13,23],[11,10,11,11],[12,10,12,11],[12,24,12,25],[14,24,14,25],[12,16,12,17],[20,6,20,7],[18,16,18,17],[16,10,16,11],[17,10,17,11],[18,10,18,11],[18,8,18,9],[19,8,19,9],[20,8,20,9],[20,10,20,11],[16,14,16,15],[16,8,16,9],[19,6,19,7],[16,6,16,7],[17,12,17,13],[18,12,18,13],[19,12,19,13],[20,12,20,13],[1,26,2,27],[3,26,3,27],[4,26,4,27],[5,26,5,27],[6,26,6,27],[7,26,7,27],[8,26,8,27],[9,26,9,27],[10,26,10,27],[15,26,15,27],[16,26,16,27],[17,26,17,27],[18,26,18,27],[17,22,17,23],[15,16,15,17],[15,24,15,25],[14,22,14,23],[12,22,12,23],[17,24,17,25],[16,22,16,23],[1,18,1,25],[7,12,7,13],[23,26,23,27],[19,26,19,27],[15,10,15,11],[14,14,14,15],[23,12,23,13],[20,26,20,27],[21,26,21,27],[22,26,22,27],[21,12,21,13],[22,12,22,13],[14,16,14,17],[15,22,15,23],[22,16,22,17],[18,24,18,25],[19,16,19,17],[19,24,19,25],[20,16,20,17],[20,24,20,25],[21,16,21,17],[16,16,16,17],[16,24,16,25],[17,16,17,17],[25,6,25,7],[26,6,26,7],[14,10,14,11],[8,14,8,15],[9,14,9,15],[10,14,10,15],[11,14,11,15],[12,14,12,15],[17,14,17,15],[13,14,13,15],[21,10,21,11],[21,6,21,7],[22,6,22,7],[17,6,17,7],[18,6,18,7],[8,6,8,7],[9,6,9,7],[10,6,10,7],[12,6,12,7],[15,12,15,13],[17,8,17,9],[21,8,21,9],[15,14,15,15],[16,12,16,13],[24,24,24,25],[23,24,23,25],[22,10,22,11],[18,14,18,15],[19,14,19,15],[27,14,27,15],[26,14,26,15],[31,1,31,27],[27,10,27,11],[27,6,27,7],[29,1,29,5],[30,1,30,5],[25,14,25,15],[19,10,19,11],[23,10,23,11],[24,10,24,11],[24,12,24,13],[25,12,25,13],[24,26,24,27],[25,26,25,27],[26,26,26,27],[27,26,27,27],[23,6,23,7],[24,6,24,7],[27,8,27,9],[21,22,21,23],[25,10,25,11],[25,16,25,17],[32,6,32,27],[34,1,34,5],[34,6,34,27],[20,14,20,15],[21,14,21,15],[22,14,22,15],[23,14,23,15],[24,14,24,15],[26,10,26,11],[32,1,32,5],[26,12,26,13],[27,12,27,13],[25,24,25,25],[21,24,21,25],[22,24,22,25],[26,16,26,17],[26,24,26,25],[28,1,28,27],[27,16,27,17],[27,24,27,25]]}
[]
[null,"Pedestrian Upper Legform",null,null,null,null,"Bending Moment",null,null,null,null,null,null,null,null,null,null,null,"Forces",null,null,null,null,null,null,null,"Total"]
[null,null,null,null,null,null,"upper",null,null,null,"centre",null,null,null,"lower",null,null,null,"upper",null,"lower",null,"sum"]
[null,{"$f":"'General Overview'!G10","v":""},null,null,null,null,"Value",null,"Points",null,"Value",null,"Points",null,"Value",null,"Points",null,"Value",null,"Value",null,"Value",null,"Points",null,"Points"]
[null,"UPPER LEGFORM"]
[]
[null,"Points to test",null,null,"Test Energy - J"]
[null,null,"U +10",null,null,null,null,null,{"$f":"IF(NOT($D8=\"Tested\"),\"\",ROUND(Sliding_Scale(G8,285,350,1,0),Round))","v":""},null,null,null,{"$f":"IF(NOT($D8=\"Tested\"),\"\",ROUND(Sliding_Scale(K8,285,350,1,0),Round))","v":""},null,null,null,{"$f":"IF(NOT($D8=\"Tested\"),\"\",ROUND(Sliding_Scale(O8,285,350,1,0),Round))","v":""},null,null,null,null,null,null,null,{"$f":"IF(NOT($D8=\"Tested\"),\"\",ROUND(Sliding_Scale(W8,5,6,1,0),Round))","v":""},null,{"$f":"IF($D8=\"N/A\",\"\",IF($D8=\"Default\",1,IF($D8=\"Tested\",MIN(I8,M8,Q8,Y8),IF($D8=\"Symmetry\",INDIRECT(ADDRESS((18-ROW(C8))*2+ROW(C8),27)),IF(OR($D8=\"Adjacent\"),MIN(AA7,AA9),\"\")))))","v":""}]
[null,null,"U +9",null,null,null,null,null,{"$f":"IF(NOT($D9=\"Tested\"),\"\",ROUND(Sliding_Scale(G9,285,350,1,0),Round))","v":""},null,null,null,{"$f":"IF(NOT($D9=\"Tested\"),\"\",ROUND(Sliding_Scale(K9,285,350,1,0),Round))","v":""},null,null,null,{"$f":"IF(NOT($D9=\"Tested\"),\"\",ROUND(Sliding_Scale(O9,285,350,1,0),Round))","v":""},null,null,null,null,null,null,null,"",null,{"$f":"IF($D9=\"N/A\",\"\",IF($D9=\"Default\",1,IF($D9=\"Tested\",MIN(I9,M9,Q9,Y9),IF($D9=\"Symmetry\",INDIRECT(ADDRESS((18-ROW(C9))*2+ROW(C9),27)),IF(OR($D9=\"Adjacent\"),MIN(AA8,AA10),\"\")))))","v":""}]
[null,null,"U +8",null,null,null,null,null,{"$f":"IF(NOT($D10=\"Tested\"),\"\",ROUND(Sliding_Scale(G10,285,350,1,0),Round))","v":""},null,null,null,{"$f":"IF(NOT($D10=\"Tested\"),\"\",ROUND(Sliding_Scale(K10,285,350,1,0),Round))","v":""},null,null,null,{"$f":"IF(NOT($D10=\"Tested\"),\"\",ROUND(Sliding_Scale(O10,285,350,1,0),Round))","v":""},null,null,null,null,null,null,null,"",null,""]
[null,null,"U +7",null,null,null,null,null,{"$f":"IF(NOT($D11=\"Tested\"),\"\",ROUND(Sliding_Scale(G11,285,350,1,0),Round))","v":""},null,null,null,{"$f":"IF(NOT($D11=\"Tested\"),\"\",ROUND(Sliding_Scale(K11,285,350,1,0),Round))","v":""},null,null,null,{"$f":"IF(NOT($D11=\"Tested\"),\"\",ROUND(Sliding_Scale(O11,285,350,1,0),Round))","v":""},null,null,null,null,null,null,null,"",null,""]
[null,null,"U +6",null,null,null,null,null,{"$f":"IF(NOT($D12=\"Tested\"),\"\",ROUND(Sliding_Scale(G12,285,350,1,0),Round))","v":""},null,null,null,{"$f":"IF(NOT($D12=\"Tested\"),\"\",ROUND(Sliding_Scale(K12,285,350,1,0),Round))","v":""},null,null,null,{"$f":"IF(NOT($D12=\"Tested\"),\"\",ROUND(Sliding_Scale(O12,285,350,1,0),Round))","v":""},null,null,null,null,null,null,null,"",null,""]
[null,null,"U +5",null,null,null,null,null,{"$f":"IF(NOT($D13=\"Tested\"),\"\",ROUND(Sliding_Scale(G13,285,350,1,0),Round))","v":""},null,null,null,{"$f":"IF(NOT($D13=\"Tested\"),\"\",ROUND(Sliding_Scale(K13,285,350,1,0),Round))","v":""},null,null,null,{"$f":"IF(NOT($D13=\"Tested\"),\"\",ROUND(Sliding_Scale(O13,285,350,1,0),Round))","v":""},null,null,null,null,null,null,null,"",null,""]
[null,null,"U +4",null,null,null,null,null,{"$f":"IF(NOT($D14=\"Tested\"),\"\",ROUND(Sliding_Scale(G14,285,350,1,0),Round))","v":""},null,null,null,{"$f":"IF(NOT($D14=\"Tested\"),\"\",ROUND(Sliding_Scale(K14,285,350,1,0),Round))","v":""},null,null,null,{"$f":"IF(NOT($D14=\"Tested\"),\"\",ROUND(Sliding_Scale(O14,285,350,1,0),Round))","v":""},null,null,null,null,null,null,null,"",null,""]
[null,null,"U +3",null,null,null,null,null,{"$f":"IF(NOT($D15=\"Tested\"),\"\",ROUND(Sliding_Scale(G15,285,350,1,0),Round))","v":""},null,null,null,{"$f":"IF(NOT($D15=\"Tested\"),\"\",ROUND(Sliding_Scale(K15,285,350,1,0),Round))","v":""},null,null,null,{"$f":"IF(NOT($D15=\"Tested\"),\"\",ROUND(Sliding_Scale(O15,285,350,1,0),Round))","v":""},null,null,null,null,null,null,null,"",null,""]
[null,null,"U +2",null,null,null,null,null,{"$f":"IF(NOT($D16=\"Tested\"),\"\",ROUND(Sliding_Scale(G16,285,350,1,0),Round))","v":""},null,null,null,{"$f":"IF(NOT($D16=\"Tested\"),\"\",ROUND(Sliding_Scale(K16,285,350,1,0),Round))","v":""},null,null,null,{"$f":"IF(NOT($D16=\"Tested\"),\"\",ROUND(Sliding_Scale(O16,285,350,1,0),Round))","v":""},null,null,null,null,null,null,null,"",null,""]
[null,null,"U +1",null,null,null,null,null,{"$f":"IF(NOT($D17=\"Tested\"),\"\",ROUND(Sliding_Scale(G17,285,350,1,0),Round))","v":""},null,null,null,{"$f":"IF(NOT($D17=\"Tested\"),\"\",ROUND(Sliding_Scale(K17,285,350,1,0),Round))","v":""},null,null,null,{"$f":"IF(NOT($D17=\"Tested\"),\"\",ROUND(Sliding_Scale(O17,285,350,1,0),Round))","v":""},null,null,null,null,null,null,null,"",null,""]
[null,null,"U 0",null,null,null,null,null,{"$f":"IF(NOT($D18=\"Tested\"),\"\",ROUND(Sliding_Scale(G18,285,350,1,0),Round))","v":""},null,null,null,{"$f":"IF(NOT($D18=\"Tested\"),\"\",ROUND(Sliding_Scale(K18,285,350,1,0),Round))","v":""},null,null,null,{"$f":"IF(NOT($D18=\"Tested\"),\"\",ROUND(Sliding_Scale(O18,285,350,1,0),Round))","v":""},null,null,null,null,null,null,null,"",null,""]
[null,null,"U -1",null,null,null,null,null,{"$f":"IF(NOT($D19=\"Tested\"),\"\",ROUND(Sliding_Scale(G19,285,350,1,0),Round))","v":""},null,null,null,{"$f":"IF(NOT($D19=\"Tested\"),\"\",ROUND(Sliding_Scale(K19,285,350,1,0),Round))","v":""},null,null,null,{"$f":"IF(NOT($D19=\"Tested\"),\"\",ROUND(Sliding_Scale(O19,285,350,1,0),Round))","v":""},null,null,null,null,null,null,null,"",null,""]
[null,null,"U -2",null,null,null,null,null,{"$f":"IF(NOT($D20=\"Tested\"),\"\",ROUND(Sliding_Scale(G20,285,350,1,0),Round))","v":""},null,null,null,{"$f":"IF(NOT($D20=\"Tested\"),\"\",ROUND(Sliding_Scale(K20,285,350,1,0),Round))","v":""},null,null,null,{"$f":"IF(NOT($D20=\"Tested\"),\"\",ROUND(Sliding_Scale(O20,285,350,1,0),Round))","v":""},null,null,null,null,null,null,null,"",null,""]
[null,null,"U -3",null,null,null,null,null,{"$f":"IF(NOT($D21=\"Tested\"),\"\",ROUND(Sliding_Scale(G21,285,350,1,0),Round))","v":""},null,null,null,{"$f":"IF(NOT($D21=\"Tested\"),\"\",ROUND(Sliding_Scale(K21,285,350,1,0),Round))","v":""},null,null,null,{"$f":"IF(NOT($D21=\"Tested\"),\"\",ROUND(Sliding_Scale(O21,285,350,1,0),Round))","v":""},null,null,null,null,null,null,null,"",null,""]
[null,null,"U -4",null,null,null,null,null,{"$f":"IF(NOT($D22=\"Tested\"),\"\",ROUND(Sliding_Scale(G22,285,350,1,0),Round))","v":""},null,null,null,{"$f":"IF(NOT($D22=\"Tested\"),\"\",ROUND(Sliding_Scale(K22,285,350,1,0),Round))","v":""},null,null,null,{"$f":"IF(NOT($D22=\"Tested\"),\"\",ROUND(Sliding_Scale(O22,285,350,1,0),Round))","v":""},null,null,null,null,null,null,null,"",null,""]
[null,null,"U -5",null,null,null,null,null,{"$f":"IF(NOT($D23=\"Tested\"),\"\",ROUND(Sliding_Scale(G23,285,350,1,0),Round))","v":""},null,null,null,{"$f":"IF(NOT($D23=\"Tested\"),\"\",ROUND(Sliding_Scale(K23,285,350,1,0),Round))","v":""},null,null,null,{"$f":"IF(NOT($D23=\"Tested\"),\"\",ROUND(Sliding_Scale(O23,285,350,1,0),Round))","v":""},null,null,null,null,null,null,null,"",null,""]
[null,null,"U -6",null,null,null,null,null,{"$f":"IF(NOT($D24=\"Tested\"),\"\",ROUND(Sliding_Scale(G24,285,350,1,0),Round))","v":""},null,null,null,{"$f":"IF(NOT($D24=\"Tested\"),\"\",ROUND(Sliding_Scale(K24,285,350,1,0),Round))","v":""},null,null,null,{"$f":"IF(NOT($D24=\"Tested\"),\"\",ROUND(Sliding_Scale(O24,285,350,1,0),Round))","v":""},null,null,null,null,null,null,null,"",null,""]
[null,null,"U -7",null,null,null,null,null,{"$f":"IF(NOT($D25=\"Tested\"),\"\",ROUND(Sliding_Scale(G25,285,350,1,0),Round))","v":""},null,null,null,{"$f":"IF(NOT($D25=\"Tested\"),\"\",ROUND(Sliding_Scale(K25,285,350,1,0),Round))","v":""},null,null,null,{"$f":"IF(NOT($D25=\"Tested\"),\"\",ROUND(Sliding_Scale(O25,285,350,1,0),Round))","v":""},null,null,null,null,null,null,null,"",null,""]
[null,null,"U -8",null,null,null,null,null,{"$f":"IF(NOT($D26=\"Tested\"),\"\",ROUND(Sliding_Scale(G26,285,350,1,0),Round))","v":""},null,null,null,{"$f":"IF(NOT($D26=\"Tested\"),\"\",ROUND(Sliding_Scale(K26,285,350,1,0),Round))","v":""},null,null,null,{"$f":"IF(NOT($D26=\"Tested\"),\"\",ROUND(Sliding_Scale(O26,285,350,1,0),Round))","v":""},null,null,null,null,null,null,null,"",null,""]
[null,null,"U -9",null,null,null,null,null,{"$f":"IF(NOT($D27=\"Tested\"),\"\",ROUND(Sliding_Scale(G27,285,350,1,0),Round))","v":""},null,null,null,{"$f":"IF(NOT($D27=\"Tested\"),\"\",ROUND(Sliding_Scale(K27,285,350,1,0),Round))","v":""},null,null,null,{"$f":"IF(NOT($D27=\"Tested\"),\"\",ROUND(Sliding_Scale(O27,285,350,1,0),Round))","v":""},null,null,null,null,null,null,null,"",null,""]
[null,null,"U -10",null,null,null,null,null,{"$f":"IF(NOT($D28=\"Tested\"),\"\",ROUND(Sliding_Scale(G28,285,350,1,0),Round))","v":""},null,null,null,{"$f":"IF(NOT($D28=\"Tested\"),\"\",ROUND(Sliding_Scale(K28,285,350,1,0),Round))","v":""},null,null,null,{"$f":"IF(NOT($D28=\"Tested\"),\"\",ROUND(Sliding_Scale(O28,285,350,1,0),Round))","v":""},null,null,null,null,null,null,null,"",null,""]
[]
[null,null,null,null,null,null,null,"+10","+9","+8","+7","+6","+5","+4","+3","+2","+1","0","-1","-2","-3","-4","-5","-6","-7","-8","-9","-10"]
[null,null,null,null,null,null,null,{"$f":"AA8","v":""},{"$f":"AA9","v":""},{"$f":"AA10","v":""},{"$f":"AA11","v":""},{"$f":"AA12","v":""},{"$f":"AA13","v":""},{"$f":"AA14","v":""},{"$f":"AA15","v":""},{"$f":"AA16","v":""},{"$f":"AA17","v":""},{"$f":"AA18","v":""},{"$f":"AA19","v":""},{"$f":"AA20","v":""},{"$f":"AA21","v":""},{"$f":"AA22","v":""},{"$f":"AA23","v":""},{"$f":"AA24","v":""},{"$f":"AA25","v":""},{"$f":"AA26","v":""},{"$f":"AA27","v":""},{"$f":"AA28","v":""}]
[]
[null,"Upper Legform assessment",null,null,null,null,{"$f":"IF(AA18=\"\",0,ROUND(SUM(AA8:AA28)/(21-COUNTIF(AA8:AA28,\"\"))*6,Round))","v":0}]
[]
[null,"TOTAL PEDESTRIAN UPPER LEGFORM",null,null,null,null,{"$f":"G33","v":0}]

{"sheet":"VRU Lower Legform","index":14,"n_rows":35,"n_cols":25,"rows_kept":35,"cut":false,"hidden":false,"merged":[[7,4,7,5],[4,4,4,13],[4,14,4,17],[5,14,5,17],[5,22,5,24],[2,16,2,17],[4,18,4,21],[5,18,5,21],[6,18,6,21],[3,22,3,24],[5,4,5,13],[6,4,6,13],[6,14,6,17],[1,1,2,3],[6,1,6,2],[5,1,5,3],[4,1,4,3],[4,22,4,24],[2,12,3,13],[3,1,3,3],[3,18,3,19],[3,20,3,21],[1,22,2,24],[1,4,1,13],[2,4,2,5],[6,22,6,24],[2,6,2,7],[2,8,2,9],[2,10,2,11],[1,14,1,17],[3,14,3,15],[3,16,3,17],[9,22,9,24],[8,22,8,24],[7,20,7,21],[9,10,9,11],[9,20,9,21],[7,18,7,19],[8,20,8,21],[9,8,9,9],[11,6,11,7],[8,8,8,9],[7,22,7,24],[8,6,8,7],[7,8,7,9],[7,10,7,11],[7,6,7,7],[11,18,11,19],[10,18,10,19],[11,16,11,17],[8,18,8,19],[7,16,7,17],[17,18,17,19],[11,12,11,13],[12,12,12,13],[13,12,13,13],[14,12,14,13],[14,22,14,24],[17,10,17,11],[18,4,18,5],[18,6,18,7],[17,16,17,17],[16,10,16,11],[12,22,12,24],[13,18,13,19],[12,4,12,5],[12,6,12,7],[16,18,16,19],[15,18,15,19],[16,8,16,9],[12,18,12,19],[14,18,14,19],[13,4,13,5],[13,6,13,7],[13,8,13,9],[13,10,13,11],[20,22,20,24],[21,18,21,19],[3,4,3,11],[19,22,19,24],[20,18,20,19],[18,22,18,24],[15,22,15,24],[21,22,21,24],[12,20,12,21],[13,20,13,21],[9,18,9,19],[11,22,11,24],[10,20,10,21],[19,18,19,19],[9,16,9,17],[10,16,10,17],[17,22,17,24],[16,22,16,24],[14,20,14,21],[15,20,15,21],[13,22,13,24],[19,16,19,17],[10,22,10,24],[12,16,12,17],[25,22,25,24],[25,20,25,21],[25,4,25,5],[32,1,32,3],[32,4,32,24],[27,16,27,17],[26,22,26,24],[27,18,27,19],[22,18,22,19],[25,16,25,17],[22,22,22,24],[23,18,23,19],[22,16,22,17],[24,16,24,17],[24,22,24,24],[25,18,25,19],[23,22,23,24],[23,12,23,13],[27,20,27,21],[27,12,27,13],[24,4,24,5],[26,4,26,5],[23,4,23,5],[27,4,27,5],[34,1,34,3],[34,4,34,24],[1,18,2,21],[7,12,7,13],[8,12,8,13],[9,12,9,13],[10,12,10,13],[11,20,11,21],[18,12,18,13],[24,12,24,13],[16,20,16,21],[17,20,17,21],[18,16,18,17],[19,12,19,13],[20,12,20,13],[21,12,21,13],[20,16,20,17],[18,18,18,19],[16,16,16,17],[27,22,27,24],[28,1,28,24],[29,1,29,3],[30,1,30,3],[31,1,31,24],[18,20,18,21],[19,20,19,21],[20,20,20,21],[21,20,21,21],[22,20,22,21],[23,20,23,21],[24,20,24,21],[25,12,25,13],[26,18,26,19],[26,12,26,13],[26,20,26,21],[24,18,24,19],[23,16,23,17],[21,16,21,17],[26,16,26,17],[17,4,17,5],[22,12,22,13],[15,12,15,13],[16,12,16,13],[17,12,17,13],[16,4,16,5],[14,6,14,7],[11,8,11,9],[14,10,14,11],[15,10,15,11],[14,4,14,5],[14,8,14,9],[12,8,12,9],[15,4,15,5],[15,6,15,7],[21,10,21,11],[22,10,22,11],[18,10,18,11],[21,6,21,7],[16,6,16,7],[17,6,17,7],[17,8,17,9],[12,10,12,11],[11,4,11,5],[27,6,27,7],[27,8,27,9],[23,10,23,11],[27,10,27,11],[24,6,24,7],[25,8,25,9],[25,10,25,11],[24,8,24,9],[24,10,24,11],[23,8,23,9],[26,6,26,7],[26,8,26,9],[26,10,26,11],[25,6,25,7],[22,4,22,5],[22,6,22,7],[23,6,23,7],[19,4,19,5],[19,6,19,7],[19,8,19,9],[19,10,19,11],[18,8,18,9],[20,4,20,5],[21,8,21,9],[22,8,22,9],[20,6,20,7],[20,8,20,9],[20,10,20,11],[21,4,21,5],[13,16,13,17],[8,16,8,17],[14,16,14,17],[15,16,15,17],[15,8,15,9],[10,4,10,5],[10,6,10,7],[10,8,10,9],[10,10,10,11],[11,10,11,11],[8,10,8,11],[9,4,9,5],[9,6,9,7],[8,4,8,5]]}
[]
[null,"Pedestrian Lower Legform",null,null,"Tibia Bending Moment",null,null,null,null,null,null,null,null,null,"ACL/PCL",null,null,null,"MCL Elongation",null,null,null,"Total"]
[null,null,null,null,"T1",null,"T2",null,"T3",null,"T4",null,"Points",null,"ACL","PCL"]
[null,{"$f":"'General Overview'!G10","v":""},null,null,"Value",null,null,null,null,null,null,null,null,null,"Value",null,"PASS/FAIL",null,"Value",null,"Points",null,"Points"]
[null,"LOWER LEGFORM"]
[]
[null,"Points to test"]
[null,null,"L +10",null,null,null,null,null,null,null,null,null,{"$f":"IF(NOT($D8=\"Tested\"),\"\",ROUND(Sliding_Scale(MAX(E8,G8,I8,K8),282,340,0.5,0),Round))","v":""},null,null,null,{"$f":"IF(NOT($D8=\"Tested\"),\"\",IF(MAX(O8,P8)>=10,\"FAIL\",\"PASS\"))","v":""},null,null,null,{"$f":"IF(NOT($D8=\"Tested\"),\"\",ROUND(Sliding_Scale(S8,19,22,0.5,0),Round))","v":""},null,{"$f":"IF($D8=\"N/A\",\"\",IF($D8=\"Tested\",M8+IF(Q8=\"PASS\",U8),IF($D8=\"Symmetry\",INDIRECT(ADDRESS((18-ROW(C8))*2+ROW(C8),23)),IF($D8=\"Adjacent\",MIN(W7,W9),\"\"))))","v":""}]
[null,null,"L +9",null,null,null,null,null,null,null,null,null,"",null,null,null,{"$f":"IF(NOT($D9=\"Tested\"),\"\",IF(MAX(O9,P9)>=10,\"FAIL\",\"PASS\"))","v":""},null,null,null,"",null,{"$f":"IF($D9=\"N/A\",\"\",IF($D9=\"Tested\",M9+IF(Q9=\"PASS\",U9),IF($D9=\"Symmetry\",INDIRECT(ADDRESS((18-ROW(C9))*2+ROW(C9),23)),IF($D9=\"Adjacent\",MIN(W8,W10),\"\"))))","v":""}]
[null,null,"L +8",null,null,null,null,null,null,null,null,null,"",null,null,null,"",null,null,null,"",null,""]
[null,null,"L +7",null,null,null,null,null,null,null,null,null,"",null,null,null,"",null,null,null,"",null,""]
[null,null,"L +6",null,null,null,null,null,null,null,null,null,"",null,null,null,"",null,null,null,"",null,""]
[null,null,"L +5",null,null,null,null,null,null,null,null,null,"",null,null,null,"",null,null,null,"",null,""]
[null,null,"L +4",null,null,null,null,null,null,null,null,null,"",null,null,null,"",null,null,null,"",null,""]
[null,null,"L +3",null,null,null,null,null,null,null,null,null,"",null,null,null,"",null,null,null,"",null,""]
[null,null,"L +2",null,null,null,null,null,null,null,null,null,"",null,null,null,"",null,null,null,"",null,""]
[null,null,"L +1",null,null,null,null,null,null,null,null,null,"",null,null,null,"",null,null,null,"",null,""]
[null,null,"L 0",null,null,null,null,null,null,null,null,null,"",null,null,null,"",null,null,null,"",null,""]
[null,null,"L -1",null,null,null,null,null,null,null,null,null,"",null,null,null,"",null,null,null,"",null,""]
[null,null,"L -2",null,null,null,null,null,null,null,null,null,"",null,null,null,"",null,null,null,"",null,""]
[null,null,"L -3",null,null,null,null,null,null,null,null,null,"",null,null,null,"",null,null,null,"",null,""]
[null,null,"L -4",null,null,null,null,null,null,null,null,null,"",null,null,null,"",null,null,null,"",null,""]
[null,null,"L -5",null,null,null,null,null,null,null,null,null,"",null,null,null,"",null,null,null,"",null,""]
[null,null,"L -6",null,null,null,null,null,null,null,null,null,"",null,null,null,"",null,null,null,"",null,""]
[null,null,"L -7",null,null,null,null,null,null,null,null,null,"",null,null,null,"",null,null,null,"",null,""]
[null,null,"L -8",null,null,null,null,null,null,null,null,null,"",null,null,null,"",null,null,null,"",null,""]
[null,null,"L -9",null,null,null,null,null,null,null,null,null,"",null,null,null,"",null,null,null,"",null,""]
[null,null,"L -10",null,null,null,null,null,null,null,null,null,"",null,null,null,"",null,null,null,"",null,""]
[]
[null,null,null,null,"+10","+9","+8","+7","+6","+5","+4","+3","+2","+1","0","-1","-2","-3","-4","-5","-6","-7","-8","-9","-10"]
[null,null,null,null,{"$f":"W8","v":""},{"$f":"W9","v":""},{"$f":"W10","v":""},{"$f":"W11","v":""},{"$f":"W12","v":""},{"$f":"W13","v":""},{"$f":"W14","v":""},{"$f":"W15","v":""},{"$f":"W16","v":""},{"$f":"W17","v":""},{"$f":"W18","v":""},{"$f":"W19","v":""},{"$f":"W20","v":""},{"$f":"W21","v":""},{"$f":"W22","v":""},{"$f":"W23","v":""},{"$f":"W24","v":""},{"$f":"W25","v":""},{"$f":"W26","v":""},{"$f":"W27","v":""},{"$f":"W28","v":""}]
[]
[null,"Lower Legform assessment",null,null,{"$f":"IF(W18=\"\",0,ROUND(SUM(W8:W28)/(21-COUNTIF(W8:W28,\"\"))*6,Round))","v":0}]
[]
[null,"TOTAL PEDESTRIAN LOWER LEGFORM",null,null,{"$f":"E33","v":0}]

{"sheet":"VRU AEB Pedestrian","index":15,"n_rows":126,"n_cols":7,"rows_kept":126,"cut":false,"hidden":false,"merged":[[1,1,2,2],[1,3,2,4],[1,5,2,6],[20,5,20,6],[21,5,21,6],[11,3,11,6],[10,3,10,6],[3,1,3,2],[4,3,4,6],[5,3,5,6],[6,3,6,6],[7,3,7,6],[8,3,8,6],[12,3,12,6],[14,5,14,6],[15,1,15,2],[13,5,13,6],[14,3,14,4],[15,3,15,4],[15,5,15,6],[18,5,18,6],[19,5,19,6],[13,3,13,4],[22,5,22,6],[57,1,57,2],[57,3,57,4],[57,5,57,6],[17,3,17,4],[17,5,17,6],[45,5,45,6],[62,5,62,6],[61,5,61,6],[29,1,29,2],[29,3,29,4],[29,5,29,6],[23,5,23,6],[24,5,24,6],[25,5,25,6],[27,5,27,6],[28,5,28,6],[26,5,26,6],[65,5,65,6],[43,1,43,2],[43,3,43,4],[43,5,43,6],[45,3,45,4],[31,3,31,4],[31,5,31,6],[60,5,60,6],[63,5,63,6],[64,5,64,6],[59,3,59,4],[59,5,59,6],[90,3,90,4],[90,5,90,6],[100,1,100,2],[100,3,100,4],[100,5,100,6],[71,1,71,2],[71,3,71,4],[71,5,71,6],[70,5,70,6],[88,1,88,2],[88,3,88,4],[88,5,88,6],[85,5,85,6],[86,5,86,6],[87,5,87,6],[84,5,84,6],[77,1,77,2],[77,3,77,4],[77,5,77,6],[81,5,81,6],[80,5,80,6],[79,5,79,6],[82,5,82,6],[66,5,66,6],[67,5,67,6],[68,5,68,6],[69,5,69,6],[73,5,73,6],[74,5,74,6],[75,5,75,6],[76,5,76,6],[83,5,83,6],[110,1,110,2],[110,3,110,4],[110,5,110,6],[112,1,112,2],[112,3,112,4],[112,5,112,6],[113,3,113,4],[113,5,113,6],[114,3,114,4],[114,5,114,6],[115,3,115,4],[115,5,115,6],[116,3,116,4],[116,5,116,6],[122,3,122,6],[123,3,123,6],[125,1,125,2],[125,3,125,6],[119,3,119,4],[119,5,119,6],[121,1,121,2],[121,3,121,6],[117,3,117,4],[117,5,117,6],[118,3,118,4],[118,5,118,6]]}
[3]
[null,"AEB Pedestrian",null,"Daytime",null,"Night-time"]
[]
[null,{"$f":"'General Overview'!G11","v":""},null,"Vimpact","Points","Vimpact","Points"]
[null,"SYSTEM DETAILS"]
[null,null,"System Name"]
[null,null,"Functionality"]
[null,null,"Speed range (km/h) - Minimum"]
[null,null,"Maximum"]
[]
[null,"PREREQUISITES"]
[]
[null,null,"Default ON"]
[null,null,"Can identify slower walking pedestrian (CPNA-75)"]
[null,null,"System switches off below 80 km/h"]
[null,"PREREQUISITES",null,{"$f":"IF(AND(D13=\"YES\",D14=\"PASS\",D15=\"NO\"),\"PASS\",\"FAIL\")","v":"FAIL"},null,{"$f":"IF(AND(D13=\"YES\",F14=\"PASS\",F15=\"NO\"),\"PASS\",\"FAIL\")","v":"FAIL"}]
[]
[null,"CPFA-50"]
[null,1,10,null,{"$f":"IF(D19=\"\",0,ROUND(($C19-IF(D19>$C19,$C19,D19))/$C19*1,Round))","v":0}]
[null,2,15,null,{"$f":"IF(D20=\"\",0,ROUND(($C20-IF(D20>$C20,$C20,D20))/$C20*1,Round))","v":0}]
[null,1,20,null,{"$f":"IF(D21=\"\",0,ROUND(($C21-IF(D21>$C21,$C21,D21))/$C21*1,Round))","v":0}]
[null,2,25,null,{"$f":"IF(D22=\"\",0,ROUND(($C22-IF(D22>$C22,$C22,D22))/$C22*1,Round))","v":0}]
[null,2,30,null,{"$f":"IF(D23=\"\",0,ROUND(($C23-IF(D23>$C23,$C23,D23))/$C23*2,Round))","v":0}]
[null,3,35,null,{"$f":"IF(D24=\"\",0,ROUND(($C24-IF(D24>$C24,$C24,D24))/$C24*3,Round))","v":0}]
[null,3,40,null,{"$f":"IF(D25=\"\",0,ROUND(($C25-IF(D25>$C25,$C25,D25))/$C25*3,Round))","v":0}]
[null,null,45,null,{"$f":"IF(D26=\"\",0,IF(D26<=(C26-20),3,0))","v":0}]
[null,null,50,null,{"$f":"IF(D27=\"\",0,IF(D27<=(C27-20),2,0))","v":0}]
[null,null,55,null,{"$f":"IF(D28=\"\",0,IF(D28<=(C28-20),2,0))","v":0}]
[null,null,60,null,{"$f":"IF(D29=\"\",0,IF(D29<=(C29-20),1,0))","v":0}]
[null,"CPFA-50 RESULT",null,{"$f":"IF((COUNTBLANK(D19:D25)+COUNTBLANK(D26:D29))>0,0,SUM(E19:E25,E26:E29))","v":0}]
[]
[null,"CPNA-25"]
[null,1,10,null,{"$f":"IF(D33=\"\",0,ROUND(($C33-IF(D33>$C33,$C33,D33))/$C33*1,Round))","v":0},null,{"$f":"IF(F33=\"\",0,ROUND(($C33-IF(F33>$C33,$C33,F33))/$C33*1,Round))","v":0}]
[null,2,15,null,{"$f":"IF(D34=\"\",0,ROUND(($C34-IF(D34>$C34,$C34,D34))/$C34*1,Round))","v":0},null,{"$f":"IF(F34=\"\",0,ROUND(($C34-IF(F34>$C34,$C34,F34))/$C34*1,Round))","v":0}]
[null,1,20,null,{"$f":"IF(D35=\"\",0,ROUND(($C35-IF(D35>$C35,$C35,D35))/$C35*1,Round))","v":0},null,{"$f":"IF(F35=\"\",0,ROUND(($C35-IF(F35>$C35,$C35,F35))/$C35*1,Round))","v":0}]
[null,2,25,null,{"$f":"IF(D36=\"\",0,ROUND(($C36-IF(D36>$C36,$C36,D36))/$C36*1,Round))","v":0},null,{"$f":"IF(F36=\"\",0,ROUND(($C36-IF(F36>$C36,$C36,F36))/$C36*1,Round))","v":0}]
[null,2,30,null,{"$f":"IF(D37=\"\",0,ROUND(($C37-IF(D37>$C37,$C37,D37))/$C37*2,Round))","v":0},null,{"$f":"IF(F37=\"\",0,ROUND(($C37-IF(F37>$C37,$C37,F37))/$C37*1,Round))","v":0}]
[null,3,35,null,{"$f":"IF(D38=\"\",0,ROUND(($C38-IF(D38>$C38,$C38,D38))/$C38*3,Round))","v":0},null,{"$f":"IF(F38=\"\",0,ROUND(($C38-IF(F38>$C38,$C38,F38))/$C38*2,Round))","v":0}]
[null,3,40,null,{"$f":"IF(D39=\"\",0,ROUND(($C39-IF(D39>$C39,$C39,D39))/$C39*3,Round))","v":0},null,{"$f":"IF(F39=\"\",0,ROUND(($C39-IF(F39>$C39,$C39,F39))/$C39*2,Round))","v":0}]
[null,null,45,null,{"$f":"IF(D40=\"\",0,IF(D40<=(C40-20),3,0))","v":0},null,{"$f":"IF(F40=\"\",0,IF(F40<=(C40-20),3,0))","v":0}]
[null,null,50,null,{"$f":"IF(D41=\"\",0,IF(D41<=(C41-20),2,0))","v":0},null,{"$f":"IF(F41=\"\",0,IF(F41<=(C41-20),3,0))","v":0}]
[null,null,55,null,{"$f":"IF(D42=\"\",0,IF(D42<=(C42-20),2,0))","v":0},null,{"$f":"IF(F42=\"\",0,IF(F42<=(C42-20),3,0))","v":0}]
[null,null,60,null,{"$f":"IF(D43=\"\",0,IF(D43<=(C43-20),1,0))","v":0},null,{"$f":"IF(F43=\"\",0,IF(F43<=(C43-20),2,0))","v":0}]
[null,"CPNA-25 RESULT",null,{"$f":"IF((COUNTBLANK(D33:D39)+COUNTBLANK(D40:D43))>0,0,SUM(E33:E39,E40:E43))","v":0},null,{"$f":"IF((COUNTBLANK(F33:F39)+COUNTBLANK(F40:F43))>0,0,SUM(G33:G39,G40:G43))","v":0}]
[]
[null,"CPNA-75"]
[null,1,10,null,{"$f":"IF(D47=\"\",0,ROUND(($C47-IF(D47>$C47,$C47,D47))/$C47*1,Round))","v":0},null,{"$f":"IF(F47=\"\",0,ROUND(($C47-IF(F47>$C47,$C47,F47))/$C47*1,Round))","v":0}]
[null,1,15,null,{"$f":"IF(D48=\"\",0,ROUND(($C48-IF(D48>$C48,$C48,D48))/$C48*1,Round))","v":0},null,{"$f":"IF(F48=\"\",0,ROUND(($C48-IF(F48>$C48,$C48,F48))/$C48*1,Round))","v":0}]
[null,2,20,null,{"$f":"IF(D49=\"\",0,ROUND(($C49-IF(D49>$C49,$C49,D49))/$C49*1,Round))","v":0},null,{"$f":"IF(F49=\"\",0,ROUND(($C49-IF(F49>$C49,$C49,F49))/$C49*1,Round))","v":0}]
[null,2,25,null,{"$f":"IF(D50=\"\",0,ROUND(($C50-IF(D50>$C50,$C50,D50))/$C50*1,Round))","v":0},null,{"$f":"IF(F50=\"\",0,ROUND(($C50-IF(F50>$C50,$C50,F50))/$C50*1,Round))","v":0}]
[null,2,30,null,{"$f":"IF(D51=\"\",0,ROUND(($C51-IF(D51>$C51,$C51,D51))/$C51*2,Round))","v":0},null,{"$f":"IF(F51=\"\",0,ROUND(($C51-IF(F51>$C51,$C51,F51))/$C51*1,Round))","v":0}]
[null,3,35,null,{"$f":"IF(D52=\"\",0,ROUND(($C52-IF(D52>$C52,$C52,D52))/$C52*3,Round))","v":0},null,{"$f":"IF(F52=\"\",0,ROUND(($C52-IF(F52>$C52,$C52,F52))/$C52*2,Round))","v":0}]
[null,3,40,null,{"$f":"IF(D53=\"\",0,ROUND(($C53-IF(D53>$C53,$C53,D53))/$C53*3,Round))","v":0},null,{"$f":"IF(F53=\"\",0,ROUND(($C53-IF(F53>$C53,$C53,F53))/$C53*2,Round))","v":0}]
[null,null,45,null,{"$f":"IF(D54=\"\",0,IF(D54<=(C54-20),3,0))","v":0},null,{"$f":"IF(F54=\"\",0,IF(F54<=(C54-20),3,0))","v":0}]
[null,null,50,null,{"$f":"IF(D55=\"\",0,IF(D55<=(C55-20),2,0))","v":0},null,{"$f":"IF(F55=\"\",0,IF(F55<=(C55-20),3,0))","v":0}]
[null,null,55,null,{"$f":"IF(D56=\"\",0,IF(D56<=(C56-20),2,0))","v":0},null,{"$f":"IF(F56=\"\",0,IF(F56<=(C56-20),3,0))","v":0}]
[null,null,60,null,{"$f":"IF(D57=\"\",0,IF(D57<=(C57-20),1,0))","v":0},null,{"$f":"IF(F57=\"\",0,IF(F57<=(C57-20),2,0))","v":0}]
[null,"CPNA-75 RESULT",null,{"$f":"IF((COUNTBLANK(D47:D53)+COUNTBLANK(D54:D57))>0,0,SUM(E47:E53,E54:E57))","v":0},null,{"$f":"IF((COUNTBLANK(F47:F53)+COUNTBLANK(F54:F57))>0,0,SUM(G47:G53,G54:G57))","v":0}]
[]
[null,"CPNC-50"]
[null,1,10,null,{"$f":"IF(D61=\"\",0,ROUND(($C61-IF(D61>$C61,$C61,D61))/$C61*1,Round))","v":0}]
[null,2,15,null,{"$f":"IF(D62=\"\",0,ROUND(($C62-IF(D62>$C62,$C62,D62))/$C62*1,Round))","v":0}]
[null,2,20,null,{"$f":"IF(D63=\"\",0,ROUND(($C63-IF(D63>$C63,$C63,D63))/$C63*1,Round))","v":0}]
[null,2,25,null,{"$f":"IF(D64=\"\",0,ROUND(($C64-IF(D64>$C64,$C64,D64))/$C64*1,Round))","v":0}]
[null,2,30,null,{"$f":"IF(D65=\"\",0,ROUND(($C65-IF(D65>$C65,$C65,D65))/$C65*2,Round))","v":0}]
[null,3,35,null,{"$f":"IF(D66=\"\",0,ROUND(($C66-IF(D66>$C66,$C66,D66))/$C66*3,Round))","v":0}]
[null,3,40,null,{"$f":"IF(D67=\"\",0,ROUND(($C67-IF(D67>$C67,$C67,D67))/$C67*3,Round))","v":0}]
[null,null,45,null,{"$f":"IF(D68=\"\",0,IF(D68<=(C68-20),3,0))","v":0}]
[null,null,50,null,{"$f":"IF(D69=\"\",0,IF(D69<=(C69-20),2,0))","v":0}]
[null,null,55,null,{"$f":"IF(D70=\"\",0,IF(D70<=(C70-20),2,0))","v":0}]
[null,null,60,null,{"$f":"IF(D71=\"\",0,IF(D71<=(C71-20),1,0))","v":0}]
[null,"CPNC-50 RESULT",null,{"$f":"IF((COUNTBLANK(D61:D67)+COUNTBLANK(D68:D71))>0,0,SUM(E61:E67,E68:E71))","v":0}]
[]
[null,"CPTA-50",null,"Farside turn","Nearside turn"]
[null,1,10]
[null,2,15]
[null,2,20]
[null,"CPTA-50 RESULT",null,{"$f":"IF((COUNTBLANK(D75:D77)+COUNTBLANK(E75)>0),0,COUNTIF(D75:D77,\"=0\")+COUNTIF(E75,\"=0\"))","v":0}]
[]
[null,"CPRA",null,"Stationary","Moving"]
[null,null,"4 km/h reverse"]
[null,1,"hitpoint @ 25%"]
[null,2,"hitpoint @ 50%"]
[null,2,"hitpoint @ 75%"]
[null,null,"8 km/h reverse"]
[null,1,"hitpoint @ 25%"]
[null,2,"hitpoint @ 50%"]
[null,2,"hitpoint @ 75%"]
[null,"CPRA RESULT",null,{"$f":"IF(COUNTIF(D82:D84,\"=0\")=3,1,0)+IF(COUNTIF(E83,\"=0\")=1,1,0)+IF(COUNTIF(D86:D88,\"=0\")=3,1,0)+IF(COUNTIF(E87,\"=0\")=1,1,0)","v":0}]
[]
[null,"CPLA-50"]
[null,1,20,null,{"$f":"IF(D92=\"\",0,ROUND((($C92-5)-(IF(D92<=5,5,IF(D92>$C92,$C92,D92))-5))/($C92-5)*$B92,Round))","v":0},null,{"$f":"IF(F92=\"\",0,ROUND((($C92-5)-(IF(F92<=5,5,IF(F92>$C92,$C92,F92))-5))/($C92-5)*$B92,Round))","v":0}]
[null,1,25,null,{"$f":"IF(D93=\"\",0,ROUND((($C93-5)-(IF(D93<=5,5,IF(D93>$C93,$C93,D93))-5))/($C93-5)*$B93,Round))","v":0},null,{"$f":"IF(F93=\"\",0,ROUND((($C93-5)-(IF(F93<=5,5,IF(F93>$C93,$C93,F93))-5))/($C93-5)*$B93,Round))","v":0}]
[null,1,30,null,{"$f":"IF(D94=\"\",0,ROUND((($C94-5)-(IF(D94<=5,5,IF(D94>$C94,$C94,D94))-5))/($C94-5)*$B94,Round))","v":0},null,{"$f":"IF(F94=\"\",0,ROUND((($C94-5)-(IF(F94<=5,5,IF(F94>$C94,$C94,F94))-5))/($C94-5)*$B94,Round))","v":0}]
[null,2,35,null,{"$f":"IF(D95=\"\",0,ROUND((($C95-5)-(IF(D95<=5,5,IF(D95>$C95,$C95,D95))-5))/($C95-5)*$B95,Round))","v":0},null,{"$f":"IF(F95=\"\",0,ROUND((($C95-5)-(IF(F95<=5,5,IF(F95>$C95,$C95,F95))-5))/($C95-5)*$B95,Round))","v":0}]
[null,2,40,null,{"$f":"IF(D96=\"\",0,ROUND((($C96-5)-(IF(D96<=5,5,IF(D96>$C96,$C96,D96))-5))/($C96-5)*$B96,Round))","v":0},null,{"$f":"IF(F96=\"\",0,ROUND((($C96-5)-(IF(F96<=5,5,IF(F96>$C96,$C96,F96))-5))/($C96-5)*$B96,Round))","v":0}]
[null,3,45,null,{"$f":"IF(D97=\"\",0,IF(D97<=(C97-20),$B97,0))","v":0},null,{"$f":"IF(F97=\"\",0,IF(F97<=($C97-20),$B97,0))","v":0}]
[null,3,50,null,{"$f":"IF(D98=\"\",0,IF(D98<=(C98-20),$B98,0))","v":0},null,{"$f":"IF(F98=\"\",0,IF(F98<=($C98-20),$B98,0))","v":0}]
[null,3,55,null,{"$f":"IF(D99=\"\",0,IF(D99<=(C99-20),$B99,0))","v":0},null,{"$f":"IF(F99=\"\",0,IF(F99<=($C99-20),$B99,0))","v":0}]
[null,2,60,null,{"$f":"IF(D100=\"\",0,IF(D100<=(C100-20),$B100,0))","v":0},null,{"$f":"IF(F100=\"\",0,IF(F100<=($C100-20),$B100,0))","v":0}]
[null,"CPLA-50 RESULT",null,{"$f":"IF((COUNTBLANK(D92:D96)+COUNTBLANK(D97:D100))>0,0,SUM(E92:E96,E97:E100))","v":0},null,{"$f":"IF((COUNTBLANK(F92:F96)+COUNTBLANK(F97:F100))>0,0,SUM(G92:G96,G97:G100))","v":0}]
[]
[null,"CPLA-25",null,"TTCFCW","Points","TTCFCW","Points"]
[null,3,50,null,{"$f":"IF(D104=\"\",0,IF(D104>=1.7,$B104,0))","v":0},null,{"$f":"IF(F104=\"\",0,IF(F104>=1.7,$B104,0))","v":0}]
[null,3,55,null,0,null,0]
[null,2,60,null,0,null,0]
[null,1,65,null,0,null,0]
[null,1,70,null,0,null,0]
[null,1,75,null,0,null,0]
[null,1,80,null,0,null,0]
[null,"CPLA-25 RESULT",null,{"$f":"IF((COUNTBLANK(D104:D108)+COUNTBLANK(D109:D110))>0,0,SUM(E104:E108,E109:E110))","v":0},null,{"$f":"IF((COUNTBLANK(F104:F108)+COUNTBLANK(F109:F110))>0,0,SUM(G104:G108,G109:G110))","v":0}]
[]
[null,"SUMMARY",null,"DAYTIME",null,"NIGHT-TIME"]
[null,null,"CPFA-50",{"$f":"ROUND(D30/20,Round)","v":0}]
[null,null,"CPNA-25",{"$f":"ROUND(D44/20,Round)","v":0},null,{"$f":"ROUND(F44/20,Round)","v":0}]
[null,null,"CPNA-75",{"$f":"ROUND(D58/20,Round)","v":0},null,{"$f":"ROUND(F58/20,Round)","v":0}]
[null,null,"CPNC-50",{"$f":"ROUND(D72/20,Round)","v":0}]
[null,null,"CPLA",{"$f":"ROUND((D101+D111)/30,Round)","v":0},null,{"$f":"ROUND((F101+F111)/30,Round)","v":0}]
[null,null,"CPTA",{"$f":"ROUND(D78/4,Round)","v":0}]
[null,null,"CPRA",{"$f":"ROUND(D89/4,Round)","v":0}]
[]
[null,"TOTAL"]
[null,null,"Daytime",{"$f":"IF(D16=\"FAIL\",0,ROUND(D114*0.5+D115*0.25+D116*0.25+D117*1+D118*1+D119*1+D120*2,Round))","v":0}]
[null,null,"Night-time",{"$f":"IF(F16=\"FAIL\",0,ROUND(F115*1+F116*1+F118*1,Round))","v":0}]
[]
[null,"TOTAL AEB Pedestrian",null,{"$f":"ROUND(SUM(D123:G124),Round)","v":0}]

{"sheet":"VRU AEB Cyclist","index":16,"n_rows":86,"n_cols":5,"rows_kept":86,"cut":false,"hidden":false,"merged":[[16,3,16,4],[28,1,28,2],[28,3,28,4],[44,3,44,4],[56,1,56,2],[56,3,56,4],[42,1,42,2],[42,3,42,4],[67,3,67,4],[77,1,77,2],[85,1,85,2],[85,3,85,4],[84,3,84,4],[81,3,81,4],[82,3,82,4],[1,1,2,2],[83,3,83,4],[79,1,79,2],[79,3,79,4],[80,3,80,4],[58,3,58,4],[30,3,30,4],[67,1,67,2],[3,1,3,2],[14,1,14,2],[14,3,14,4],[11,3,11,4],[77,3,77,4],[1,3,2,4],[12,3,12,4],[13,3,13,4],[10,3,10,4],[4,3,4,4],[5,3,5,4],[6,3,6,4],[7,3,7,4],[8,3,8,4]]}
[3]
[null,"AEB Cyclist"]
[]
[null,{"$f":"'General Overview'!G12","v":""},null,"Vimpact","Points"]
[null,"SYSTEM DETAILS"]
[null,null,"System Name"]
[null,null,"Functionality"]
[null,null,"Speed range (km/h) - Minimum"]
[null,null,"Maximum"]
[]
[null,"PREREQUISITES"]
[]
[null,null,"Default ON"]
[null,null,"System switches off below 80 km/h"]
[null,"PREREQUISITES",null,{"$f":"IF(AND(D13=\"YES\",D14=\"NO\"),\"PASS\",\"FAIL\")","v":"FAIL"}]
[]
[null,"CBFA"]
[null,null,10,null,{"$f":"IF(D18=\"\",0,ROUND(($C18-IF(D18>$C18,$C18,D18))/$C18*1,Round))","v":0}]
[null,null,15,null,0]
[null,null,20,null,0]
[null,null,25,null,0]
[null,null,30,null,0]
[null,null,35,null,0]
[null,null,40,null,0]
[null,null,45,null,{"$f":"IF(D25=\"\",0,IF(D25<=(C25-20),1,0))","v":0}]
[null,null,50,null,{"$f":"IF(D26=\"\",0,IF(D26<=(C26-20),1,0))","v":0}]
[null,null,55,null,{"$f":"IF(D27=\"\",0,IF(D27<=(C27-20),1,0))","v":0}]
[null,null,60,null,{"$f":"IF(D28=\"\",0,IF(D28<=(C28-20),1,0))","v":0}]
[null,"CBFA RESULT",null,{"$f":"IF((COUNTBLANK(D18:D24)+COUNTBLANK(D25:D28))>0,0,SUM(E18:E24,E25:E28))","v":0}]
[]
[null,"CBNA"]
[null,null,10,null,{"$f":"IF(D32=\"\",0,ROUND(($C32-IF(D32>$C32,$C32,D32))/$C32*1,Round))","v":0}]
[null,null,15,null,0]
[null,null,20,null,0]
[null,null,25,null,0]
[null,null,30,null,0]
[null,null,35,null,0]
[null,null,40,null,0]
[null,null,45,null,{"$f":"IF(D39=\"\",0,IF(D39<=(C39-20),1,0))","v":0}]
[null,null,50,null,{"$f":"IF(D40=\"\",0,IF(D40<=(C40-20),1,0))","v":0}]
[null,null,55,null,{"$f":"IF(D41=\"\",0,IF(D41<=(C41-20),1,0))","v":0}]
[null,null,60,null,{"$f":"IF(D42=\"\",0,IF(D42<=(C42-20),1,0))","v":0}]
[null,"CBNA RESULT",null,{"$f":"IF((COUNTBLANK(D32:D38)+COUNTBLANK(D39:D42))>0,0,SUM(E32:E38,E39:E42))","v":0}]
[]
[null,"CBNAO"]
[null,null,10,null,{"$f":"IF(D46=\"\",0,ROUND(($C46-IF(D46>$C46,$C46,D46))/$C46*1,Round))","v":0}]
[null,null,15,null,0]
[null,null,20,null,0]
[null,null,25,null,0]
[null,null,30,null,0]
[null,null,35,null,0]
[null,null,40,null,0]
[null,null,45,null,{"$f":"IF(D53=\"\",0,IF(D53<=(C53-20),1,0))","v":0}]
[null,null,50,null,{"$f":"IF(D54=\"\",0,IF(D54<=(C54-20),1,0))","v":0}]
[null,null,55,null,{"$f":"IF(D55=\"\",0,IF(D55<=(C55-20),1,0))","v":0}]
[null,null,60,null,{"$f":"IF(D56=\"\",0,IF(D56<=(C56-20),1,0))","v":0}]
[null,"CBNAO RESULT",null,{"$f":"IF((COUNTBLANK(D46:D52)+COUNTBLANK(D53:D56))>0,0,SUM(E46:E52,E53:E56))","v":0}]
[]
[null,"CBLA-50"]
[null,1,25,null,{"$f":"IF(D60=\"\",0,ROUND((($C60-15)-(IF(D60<=15,15,IF(D60>$C60,$C60,D60))-15))/($C60-15)*$B60,Round))","v":0}]
[null,1,30,null,{"$f":"IF(D61=\"\",0,ROUND((($C61-15)-(IF(D61<=15,15,IF(D61>$C61,$C61,D61))-15))/($C61-15)*$B61,Round))","v":0}]
[null,2,35,null,{"$f":"IF(D62=\"\",0,ROUND((($C62-15)-(IF(D62<=15,15,IF(D62>$C62,$C62,D62))-15))/($C62-15)*$B62,Round))","v":0}]
[null,2,40,null,{"$f":"IF(D63=\"\",0,ROUND((($C63-15)-(IF(D63<=15,15,IF(D63>$C63,$C63,D63))-15))/($C63-15)*$B63,Round))","v":0}]
[null,3,45,null,{"$f":"IF(D64=\"\",0,IF(D64<=(C64-20),$B64,0))","v":0}]
[null,3,50,null,{"$f":"IF(D65=\"\",0,IF(D65<=(C65-20),$B65,0))","v":0}]
[null,3,55,null,{"$f":"IF(D66=\"\",0,IF(D66<=(C66-20),$B66,0))","v":0}]
[null,1,60,null,{"$f":"IF(D67=\"\",0,IF(D67<=(C67-20),$B67,0))","v":0}]
[null,"CBLA-50 RESULT",null,{"$f":"IF((COUNTBLANK(D60:D63)+COUNTBLANK(D64:D67))>0,0,SUM(E60:E63,E64:E67))","v":0}]
[]
[null,"CBLA-25",null,"TTCFCW","Points"]
[null,3,50,null,{"$f":"IF(D71=\"\",0,IF(D71>=1.7,$B71,0))","v":0}]
[null,3,55,null,{"$f":"IF(D72=\"\",0,IF(D72>=1.7,$B72,0))","v":0}]
[null,1,60,null,0]
[null,1,65,null,0]
[null,1,70,null,0]
[null,1,75,null,0]
[null,1,80,null,0]
[null,"CBLA-25 RESULT",null,{"$f":"IF((COUNTBLANK(D71:D75)+COUNTBLANK(D76:D77))>0,0,SUM(E71:E75,E76:E77))","v":0}]
[]
[null,"SUMMARY"]
[null,null,"CBFA",{"$f":"ROUND(D29/11,Round)","v":0}]
[null,null,"CBNA",{"$f":"ROUND(D43/11,Round)","v":0}]
[null,null,"CBNAO",{"$f":"ROUND(D57/11,Round)","v":0}]
[null,null,"CBLA",{"$f":"ROUND((D68+D78)/27,Round)","v":0}]
[]
[null,"TOTAL AEB Cyclist",null,{"$f":"IF(D15=\"FAIL\",0,ROUND(D81*3+D82*1.5+D83*1.5+D84*3,Round))","v":0}]

{"sheet":"SA OSM","index":17,"n_rows":21,"n_cols":9,"rows_kept":21,"cut":false,"hidden":false,"merged":[[19,1,19,2],[8,1,8,2],[15,1,15,2],[13,1,13,2],[10,5,10,8],[13,3,13,8],[11,3,11,4],[11,5,12,8],[12,3,12,4],[8,3,8,6],[6,3,6,4],[7,3,7,4],[19,3,19,8],[3,3,3,4],[8,7,8,8],[7,5,7,6],[6,5,6,6],[5,7,7,7],[5,5,5,6],[5,3,5,4],[10,3,10,4],[15,3,15,8],[16,3,16,8],[17,3,17,8],[1,1,2,2],[1,3,2,4],[3,1,3,2],[4,3,4,4],[1,7,2,8],[4,7,4,8],[1,5,2,6],[4,5,4,6],[3,5,3,6]]}
[]
[null,"Occupant Status Monitoring",null,"Driver",null,"Front Passenger",null,"Rear Passengers"]
[]
[null,{"$f":"'General Overview'!G13","v":""},null,"Score",null,"Score",null,"Nr of seats","Score"]
[null,"SEAT BELT REMINDER"]
[null,null,"Occupant detection",null,null,null,null,{"$f":"SUM('General Overview'!C17:D18)","v":0}]
[null,null,"Visual warning"]
[null,null,"Audible warning"]
[null,"Seat Belt Reminder assessment",null,{"$f":"IF(COUNTIF(D6:G8,\"Pass\")=5,\"PASS\",\"FAIL\")","v":"FAIL"},null,null,null,{"$f":"IF(H6=0,0,IF(OR(I7=\"\",I8=\"\"),0,IF(OR(I7=\"Fail\",I8=\"Fail\"),0,ROUND((MIN(LEFT(I7,1),LEFT(I8,1))*1/H6)+IF(I6=\"Fail\",0,(LEFT(I6,1)*1/H6)),Round))))","v":0}]
[]
[null,"DRIVER MONITORING"]
[null,null,"Default ON",null,null,{"$f":"IF(AND(D12=\"PASS\",D13=\"PASS\"),1,0)","v":0}]
[null,null,"Attention Assist dossier"]
[null,"Driver Monitoring assessment",null,{"$f":"IF('General Overview'!E61=\"Standard\",F12,0)","v":0}]
[]
[null,"SUMMARY"]
[null,null,"Seat Belt Reminder assessment",{"$f":"IF(D9=\"FAIL\",0,IF(H6=0,IF(D9=\"PASS\",2,0),SUM(H9)))","v":0}]
[null,null,"Driver Monitoring assessment",{"$f":"D14","v":0}]
[]
[null,"TOTAL OCCUPANT STATUS MONITORING",null,{"$f":"D17+D18","v":0}]
[null,null,null,{"$f":"IF(AND(D9=2,H9>0),\"All seats\",IF(D9=2,\"Front seats\",\"Not available\"))","v":"Not available"}]

{"sheet":"SA SAS","index":18,"n_rows":49,"n_cols":5,"rows_kept":49,"cut":false,"hidden":false,"merged":[[8,3,8,4],[28,1,28,2],[28,3,28,4],[6,3,6,4],[1,1,2,2],[1,3,2,4],[3,1,3,2],[4,3,4,4],[5,3,5,4],[9,3,9,4],[11,3,11,4],[48,1,48,2],[48,3,48,4],[42,1,42,2],[42,3,42,4],[45,3,45,4],[44,1,44,2],[44,3,44,4],[30,3,30,4],[31,3,31,4],[46,3,46,4],[33,3,33,4],[32,3,32,4]]}
[]
[null,"Speed Assist System"]
[]
[null,{"$f":"'General Overview'!G14","v":""},null,"Value","Score"]
[null,"SYSTEM DETAILS"]
[null,null,"System name"]
[null,null,"Functionality"]
[]
[null,"SPEED LIMIT INFORMATION FUNCTION"]
[null,null,"Type of system"]
[null,null,"General requirements",null,{"$f":"IF(D11=\"Pass\",0.5,0)","v":0}]
[null,null,"Advanced Functions"]
[null,null,"Weather - Rain / Wetness",null,{"$f":"IF(D13=\"Pass\",0.05,0)","v":0}]
[null,null,"Weather - Snow / Icy",null,{"$f":"IF(D14=\"Pass\",0.05,0)","v":0}]
[null,null,"Time",null,{"$f":"IF(D15=\"Pass\",0.075,0)","v":0}]
[null,null,"Distance For / In",null,{"$f":"IF(D16=\"Pass\",0.025,0)","v":0}]
[null,null,"Arrows",null,{"$f":"IF(D17=\"Pass\",0.025,0)","v":0}]
[null,null,"Vehicle Categories",null,{"$f":"IF(D18=\"Pass\",0.025,0)","v":0}]
[null,null,"Implicit Speed Limits - Highway / Motorway",null,{"$f":"IF(D19=\"Pass\",0.05,0)","v":0}]
[null,null,"Implicit Speed Limits - City Entry / Exit",null,{"$f":"IF(D20=\"Pass\",0.075,0)","v":0}]
[null,null,"Implicit Speed Limits - Residential Zones",null,{"$f":"IF(D21=\"Pass\",0.05,0)","v":0}]
[null,null,"Dynamic Speed Limits",null,{"$f":"IF(D22=\"Pass\",0.075,0)","v":0}]
[null,null,"System Accuracy",null,{"$f":"IF(AND(SUM(E13:E22)>0.3,D24=\"PASS\"),0.25,0)","v":0}]
[null,null,"Map update",null,{"$f":"IF(D24=\"\",\"\",IF(D24<>\"Other\",\"Pass\",\"Fail\"))","v":""}]
[null,null,"Warning Function",null,{"$f":"IF(AND(E26=\"Pass\",E27=\"Pass\",E28=\"Pass\"),0.25,0)","v":0}]
[null,null,"Position of warning",null,{"$f":"IF(D26=\"\",\"\",IF(D26<>\"Other\",\"Pass\",\"Fail\"))","v":""}]
[null,null,"Type of warning",null,{"$f":"IF(D27=\"\",\"\",IF(D27<>\"Other\",\"Pass\",\"Fail\"))","v":""}]
[null,null,"Total duration ",null,{"$f":"IF(D28=\"\",\"\",IF(AND(D28<>\"\",D28>=10),\"Pass\",\"Fail\"))","v":""}]
[null,"SPEED LIMIT INFORMATION FUNCTION RESULT",null,{"$f":"SUM(E11:E25)","v":0}]
[]
[null,"SPEED CONTROL FUNCTION"]
[null,null,"Setting Vadj"]
[]
[null,null,"50 km/h test"]
[null,null,"Vstab",null,{"$f":"IF(AND(D35<>\"\",D35>=45),\"Pass\",\"Fail\")","v":"Fail"}]
[null,null,"difference between Vstab and Vadj",{"$f":"IF(D35=\"\",\"\",50-D35)","v":""}]
[null,null,"80 km/h test"]
[null,null,"Vstab",null,{"$f":"IF(AND(D38<>\"\",D38>=75),\"Pass\",\"Fail\")","v":"Fail"}]
[null,null,"difference between Vstab and Vadj",{"$f":"IF(D38=\"\",\"\",80-D38)","v":""}]
[null,null,"120 km/h test"]
[null,null,"Vstab",null,{"$f":"IF(AND(D41<>\"\",D41>=115),\"Pass\",\"Fail\")","v":"Fail"}]
[null,null,"difference between Vstab and Vadj",{"$f":"IF(D41=\"\",\"\",120-D41)","v":""}]
[null,"SPEED CONTROL FUNCTION RESULT",null,{"$f":"IF(AND(D36<=5,D39<=5,D42<=5),IF(D32=\"System advised\",1.5,IF(D32=\"Manually set\",IF(D29>0,0.75,1.25),0)),0)","v":0}]
[]
[null,"SUMMARY"]
[null,null,"Speed Limit Information Function",{"$f":"D29","v":0}]
[null,null,"Speed Control Function",{"$f":"D43","v":0}]
[]
[null,"TOTAL SAS",null,{"$f":"ROUND(SUM(D46:E47),Round)","v":0}]

{"sheet":"SA AEB Car-to-Car","index":19,"n_rows":112,"n_cols":13,"rows_kept":112,"cut":false,"hidden":false,"merged":[[98,1,98,2],[98,3,98,7],[98,8,98,12],[80,1,80,2],[80,3,80,4],[80,8,80,9],[108,3,108,12],[86,8,86,12],[87,8,87,12],[89,8,89,12],[85,8,85,12],[88,8,88,12],[90,1,90,2],[90,3,90,7],[90,8,90,12],[102,3,102,7],[102,8,102,12],[85,3,85,4],[85,5,85,7],[86,3,86,4],[96,1,96,2],[96,3,96,12],[82,1,82,2],[82,3,82,7],[109,3,109,12],[111,1,111,2],[111,3,111,12],[103,3,103,12],[105,1,105,2],[105,3,105,12],[106,3,106,12],[107,3,107,12],[99,3,99,7],[99,8,99,12],[100,3,100,7],[100,8,100,12],[101,3,101,7],[101,8,101,12],[82,8,82,12],[92,3,92,12],[93,3,93,12],[94,3,94,4],[94,5,94,12],[95,3,95,4],[95,5,95,12],[84,1,84,12],[85,1,85,2],[78,3,78,4],[79,3,79,4],[77,3,77,4],[75,3,75,4],[76,3,76,4],[72,3,72,4],[73,3,73,4],[71,3,71,4],[74,3,74,4],[70,3,70,4],[64,3,64,4],[65,3,65,4],[63,3,63,4],[66,3,66,4],[67,3,67,4],[68,3,68,4],[69,3,69,4],[51,10,51,12],[61,3,61,4],[62,3,62,4],[59,1,59,2],[55,8,55,9],[55,10,55,12],[56,1,56,2],[56,3,56,7],[56,8,56,12],[58,1,58,12],[59,3,59,4],[60,3,60,4],[11,8,11,12],[13,3,13,7],[13,8,13,12],[16,1,16,2],[7,8,7,12],[8,3,8,7],[8,8,8,12],[10,3,10,7],[10,8,10,12],[7,3,7,7],[11,3,11,7],[14,1,14,2],[14,3,14,12],[12,3,12,7],[12,8,12,12],[4,8,4,12],[5,3,5,7],[5,8,5,12],[6,3,6,7],[6,8,6,12],[1,8,1,12],[2,1,2,2],[2,3,2,7],[2,8,2,12],[3,3,3,7],[3,8,3,12],[3,1,3,2],[1,1,1,2],[1,3,1,7],[4,3,4,7],[49,1,49,2],[49,3,49,4],[49,5,49,7],[49,8,49,9],[49,10,49,12],[50,3,50,4],[55,3,55,4],[50,5,50,7],[52,3,52,4],[52,5,52,7],[55,5,55,7],[52,8,52,9],[52,10,52,12],[53,3,53,7],[53,8,53,12],[54,3,54,4],[54,5,54,7],[54,8,54,9],[54,10,54,12],[50,8,50,9],[50,10,50,12],[51,3,51,4],[51,5,51,7],[51,8,51,9],[35,8,35,12],[36,8,36,12],[37,8,37,12],[38,8,38,12],[17,8,17,12],[18,8,18,12],[19,8,19,12],[20,8,20,12],[48,1,48,12],[32,8,32,12],[34,1,34,2],[35,1,45,1],[46,1,46,2],[46,3,46,7],[46,8,46,12],[28,3,28,7],[29,3,29,7],[30,3,30,7],[31,3,31,7],[32,1,32,2],[32,3,32,7],[17,1,31,1],[26,3,26,7],[27,3,27,7]]}
[3]
[null,"AEB CAR-TO-CAR",null,"AEB",null,null,null,null,"FCW"]
[null,{"$f":"'General Overview'!G15","v":""}]
[null,"SYSTEM DETAILS"]
[null,null,"System name"]
[null,null,"AEB and/or FCW"]
[null,null,"Functionality"]
[null,null,"Speed range (km/h) - Minimum"]
[null,null,"Maximum"]
[]
[null,"PREREQUISITES"]
[null,null,"Default ON after every journey"]
[null,null,"Loud and Clear FCW"]
[null,null,"System switches off below 130 km/h"]
[null,"PREREQUISITES",null,{"$f":"IF(AND(D12=\"PASS\",D13=\"PASS\",D14=\"NO\",I12=\"PASS\",I13=\"PASS\",I14=\"NO\"),\"PASS\",\"FAIL\")","v":"FAIL"}]
[]
[null,"CCRs",null,-0.5,-0.75,1,0.75,0.5,-0.5,-0.75,1,0.75,0.5]
[null,"Test Speed",10]
[null,null,15]
[null,null,20]
[null,null,25]
[null,null,30]
[null,null,35]
[null,null,40]
[null,null,45]
[null,null,50]
[null,null,55]
[null,null,60]
[null,null,65]
[null,null,70]
[null,null,75]
[null,null,80]
[null,"Predicted CCRs score",null,0,null,null,null,null,0]
[]
[null,"CCRm",null,-0.5,-0.75,1,0.75,0.5,-0.5,-0.75,1,0.75,0.5]
[null,"Test Speed",30]
[null,null,35]
[null,null,40]
[null,null,45]
[null,null,50]
[null,null,55]
[null,null,60]
[null,null,65]
[null,null,70]
[null,null,75]
[null,null,80]
[null,"Predicted CCRm score",null,0,null,null,null,null,0]
[]
[null,"CCRb"]
[null,"Testpoints CCRb",null,"Impact Speed",null,"Points",null,null,"Impact Speed",null,"Points"]
[null,null,"12m headway"]
[null,null,"-2m/s² EVT acceleration",null,null,{"$f":"IF(D52=\"Green\",1,IF(D52=\"Yellow\",0.75,IF(D52=\"Orange\",0.5,IF(D52=\"Brown\",0.25,0))))","v":0},null,null,null,null,{"$f":"IF(I52=\"Green\",1,IF(I52=\"Yellow\",0.75,IF(I52=\"Orange\",0.5,IF(I52=\"Brown\",0.25,0))))","v":0}]
[null,null,"-6m/s² EVT acceleration",null,null,{"$f":"IF(D53=\"Green\",1,IF(D53=\"Yellow\",0.75,IF(D53=\"Orange\",0.5,IF(D53=\"Brown\",0.25,0))))","v":0},null,null,null,null,{"$f":"IF(I53=\"Green\",1,IF(I53=\"Yellow\",0.75,IF(I53=\"Orange\",0.5,IF(I53=\"Brown\",0.25,0))))","v":0}]
[null,null,"40m headway"]
[null,null,"-2m/s² EVT acceleration",null,null,{"$f":"IF(D55=\"Green\",1,IF(D55=\"Yellow\",0.75,IF(D55=\"Orange\",0.5,IF(D55=\"Brown\",0.25,0))))","v":0},null,null,null,null,{"$f":"IF(I55=\"Green\",1,IF(I55=\"Yellow\",0.75,IF(I55=\"Orange\",0.5,IF(I55=\"Brown\",0.25,0))))","v":0}]
[null,null,"-6m/s² EVT acceleration",null,null,{"$f":"IF(D56=\"Green\",1,IF(D56=\"Yellow\",0.75,IF(D56=\"Orange\",0.5,IF(D56=\"Brown\",0.25,0))))","v":0},null,null,null,null,{"$f":"IF(I56=\"Green\",1,IF(I56=\"Yellow\",0.75,IF(I56=\"Orange\",0.5,IF(I56=\"Brown\",0.25,0))))","v":0}]
[null,"CCRb RESULT",null,{"$f":"SUM(F52:H53,F55:H56)/4","v":0},null,null,null,null,{"$f":"SUM(K52:M53,K55:M56)/4","v":0}]
[]
[null,"VERIFICATION TESTS"]
[null,null,null,"Testpoint",null,"Prediction","Vimpact","Points","Testpoint","ESS","Prediction","Vimpact","Points"]
[null,null,null,null,null,null,null,{"$f":"IF(G61=\"\",\"\",actual_AEB_score(D61,G61,F61))","v":""},null,null,null,null,{"$f":"IF(L61=\"\",\"\",actual_AEB_score(I61,L61,K61))","v":""}]
[null,null,null,null,null,null,null,{"$f":"IF(G62=\"\",\"\",actual_AEB_score(D62,G62,F62))","v":""},null,null,null,null,{"$f":"IF(L62=\"\",\"\",actual_AEB_score(I62,L62,K62))","v":""}]
[null,null,null,null,null,null,null,{"$f":"IF(G63=\"\",\"\",actual_AEB_score(D63,G63,F63))","v":""},null,null,null,null,{"$f":"IF(L63=\"\",\"\",actual_AEB_score(I63,L63,K63))","v":""}]
[null,null,null,null,null,null,null,{"$f":"IF(G64=\"\",\"\",actual_AEB_score(D64,G64,F64))","v":""},null,null,null,null,{"$f":"IF(L64=\"\",\"\",actual_AEB_score(I64,L64,K64))","v":""}]
[null,null,null,null,null,null,null,{"$f":"IF(G65=\"\",\"\",actual_AEB_score(D65,G65,F65))","v":""},null,null,null,null,{"$f":"IF(L65=\"\",\"\",actual_AEB_score(I65,L65,K65))","v":""}]
[null,null,null,null,null,null,null,{"$f":"IF(G66=\"\",\"\",actual_AEB_score(D66,G66,F66))","v":""},null,null,null,null,{"$f":"IF(L66=\"\",\"\",actual_AEB_score(I66,L66,K66))","v":""}]
[null,null,null,null,null,null,null,{"$f":"IF(G67=\"\",\"\",actual_AEB_score(D67,G67,F67))","v":""},null,null,null,null,{"$f":"IF(L67=\"\",\"\",actual_AEB_score(I67,L67,K67))","v":""}]
[null,null,null,null,null,null,null,{"$f":"IF(G68=\"\",\"\",actual_AEB_score(D68,G68,F68))","v":""},null,null,null,null,{"$f":"IF(L68=\"\",\"\",actual_AEB_score(I68,L68,K68))","v":""}]
[null,null,null,null,null,null,null,{"$f":"IF(G69=\"\",\"\",actual_AEB_score(D69,G69,F69))","v":""},null,null,null,null,{"$f":"IF(L69=\"\",\"\",actual_AEB_score(I69,L69,K69))","v":""}]
[null,null,null,null,null,null,null,{"$f":"IF(G70=\"\",\"\",actual_AEB_score(D70,G70,F70))","v":""},null,null,null,null,{"$f":"IF(L70=\"\",\"\",actual_AEB_score(I70,L70,K70))","v":""}]
[null,null,null,null,null,null,null,{"$f":"IF(G71=\"\",\"\",actual_AEB_score(D71,G71,F71))","v":""},null,null,null,null,{"$f":"IF(L71=\"\",\"\",actual_AEB_score(I71,L71,K71))","v":""}]
[null,null,null,null,null,null,null,{"$f":"IF(G72=\"\",\"\",actual_AEB_score(D72,G72,F72))","v":""},null,null,null,null,{"$f":"IF(L72=\"\",\"\",actual_AEB_score(I72,L72,K72))","v":""}]
[null,null,null,null,null,null,null,{"$f":"IF(G73=\"\",\"\",actual_AEB_score(D73,G73,F73))","v":""},null,null,null,null,{"$f":"IF(L73=\"\",\"\",actual_AEB_score(I73,L73,K73))","v":""}]
[null,null,null,null,null,null,null,{"$f":"IF(G74=\"\",\"\",actual_AEB_score(D74,G74,F74))","v":""},null,null,null,null,{"$f":"IF(L74=\"\",\"\",actual_AEB_score(I74,L74,K74))","v":""}]
[null,null,null,null,null,null,null,{"$f":"IF(G75=\"\",\"\",actual_AEB_score(D75,G75,F75))","v":""},null,null,null,null,{"$f":"IF(L75=\"\",\"\",actual_AEB_score(I75,L75,K75))","v":""}]
[null,null,null,null,null,null,null,{"$f":"IF(G76=\"\",\"\",actual_AEB_score(D76,G76,F76))","v":""},null,null,null,null,{"$f":"IF(L76=\"\",\"\",actual_AEB_score(I76,L76,K76))","v":""}]
[null,null,null,null,null,null,null,{"$f":"IF(G77=\"\",\"\",actual_AEB_score(D77,G77,F77))","v":""},null,null,null,null,{"$f":"IF(L77=\"\",\"\",actual_AEB_score(I77,L77,K77))","v":""}]
[null,null,null,null,null,null,null,{"$f":"IF(G78=\"\",\"\",actual_AEB_score(D78,G78,F78))","v":""},null,null,null,null,{"$f":"IF(L78=\"\",\"\",actual_AEB_score(I78,L78,K78))","v":""}]
[null,null,null,null,null,null,null,{"$f":"IF(G79=\"\",\"\",actual_AEB_score(D79,G79,F79))","v":""},null,null,null,null,{"$f":"IF(L79=\"\",\"\",actual_AEB_score(I79,L79,K79))","v":""}]
[null,null,null,null,null,null,null,{"$f":"IF(G80=\"\",\"\",actual_AEB_score(D80,G80,F80))","v":""},null,null,null,null,{"$f":"IF(L80=\"\",\"\",actual_AEB_score(I80,L80,K80))","v":""}]
[null,"Total",null,null,null,{"$f":"(COUNTIF(F61:F80,\"Green\")*1)+(COUNTIF(F61:F80,\"Yellow\")*0.75)+(COUNTIF(F61:F80,\"Orange\")*0.5)+(COUNTIF(F61:F80,\"Brown\")*0.25)","v":0},null,{"$f":"SUM(H61:H80)","v":0},null,null,{"$f":"(COUNTIF(K61:K80,\"Green\")*1)+(COUNTIF(K61:K80,\"Yellow\")*0.75)+(COUNTIF(K61:K80,\"Orange\")*0.5)+(COUNTIF(K61:K80,\"Brown\")*0.25)","v":0},null,{"$f":"SUM(M61:M80)","v":0}]
[]
[null,"Correction factor",null,{"$f":"IF(F81=0,0,ROUND(H81/F81,Round))","v":0},null,null,null,null,{"$f":"IF(K81=0,0,ROUND(M81/K81,Round))","v":0}]
[]
[null,"CCFtap"]
[null,"Testpoints CCFtap",null,"Test speed",null,"GVT speed"]
[null,null,null,null,null,"30 km/h","45 km/h","55 km/h"]
[null,null,null,null,"10 km/h"]
[null,null,null,null,"15 km/h"]
[null,null,null,null,"20 km/h"]
[null,"CCFtap RESULT",null,{"$f":"COUNTIF(F88:H90,\"Green\")/9","v":0}]
[]
[null,"HMI"]
[null,null,"Additional HMI features"]
[null,null,"Suplementary warning",null,null,{"$f":"IF(D95=\"Yes\",1,0)","v":0}]
[null,null,"Restraint activation / dynamic retractors",null,null,{"$f":"IF(D96=\"Yes\",1,0)","v":0}]
[null,"HMI RESULT",null,{"$f":"SUM(F95:M96)/2","v":0}]
[]
[null,"SUMMARY"]
[null,null,"CCRs (prediction x correction factor)",{"$f":"IF('AOP Whiplash'!D71>=2.25,MIN(D33*D83,1),0)","v":{"$error":"#NAME?"}},null,null,null,null,{"$f":"MIN(I33*I83,1)","v":0}]
[null,null,"CCRm (prediction x correction factor)",{"$f":"MIN(D47*D83,1)","v":0},null,null,null,null,{"$f":"MIN(I47*I83,1)","v":0}]
[null,null,"CCRb",{"$f":"D57","v":0},null,null,null,null,{"$f":"I57","v":0}]
[null,null,"CCFtap",{"$f":"D91","v":0}]
[null,null,"HMI",{"$f":"D97","v":0}]
[]
[null,"TOTAL"]
[null,null,"AEB",{"$f":"ROUND(AVERAGE(D100:H102)*2,Round)","v":{"$error":"#NAME?"}}]
[null,null,"FCW",{"$f":"ROUND(AVERAGE(I100:M102)*1.5,Round)","v":0}]
[null,null,"CCFtap",{"$f":"ROUND(D103*2,Round)","v":0}]
[null,null,"HMI",{"$f":"D104*0.5","v":0}]
[]
[null,"TOTAL AEB CAR-TO-CAR",null,{"$f":"IF(D15=\"PASS\",SUM(D107:M110),0)","v":0}]

{"sheet":"SA LSS","index":20,"n_rows":72,"n_cols":13,"rows_kept":72,"cut":false,"hidden":false,"merged":[[28,1,28,2],[24,3,24,8],[25,3,25,8],[26,3,26,8],[27,3,27,8],[24,9,24,14],[25,9,25,14],[26,9,26,14],[27,9,27,14],[28,3,28,14],[23,3,23,8],[23,9,23,14],[19,3,19,5],[19,6,19,8],[19,9,19,11],[19,12,19,14],[20,3,20,5],[20,6,20,8],[20,9,20,11],[20,12,20,14],[21,3,21,5],[21,6,21,8],[21,9,21,11],[21,12,21,14],[16,6,16,8],[16,9,16,11],[16,12,16,14],[17,3,17,5],[17,6,17,8],[17,9,17,11],[17,12,17,14],[18,3,18,5],[18,6,18,8],[18,9,18,11],[18,12,18,14],[6,3,6,14],[1,1,2,2],[3,1,3,2],[4,3,4,14],[5,3,5,14],[1,3,3,14],[13,1,13,2],[13,3,13,14],[14,1,14,14],[15,3,15,14],[7,3,7,14],[8,3,8,14],[9,3,9,14],[10,1,10,14],[11,3,11,14],[12,3,12,14],[16,3,16,5],[49,1,49,2],[49,3,49,14],[35,3,35,8],[47,3,47,14],[35,9,35,14],[36,3,36,8],[36,9,36,14],[34,1,34,2],[34,3,34,14],[22,1,22,2],[22,3,22,14],[32,3,32,14],[37,3,37,8],[37,9,37,14],[38,3,38,8],[38,9,38,14],[39,3,39,8],[39,9,39,14],[29,3,29,14],[30,3,30,14],[31,3,31,14],[33,3,33,14],[51,3,51,8],[51,9,51,14],[40,3,40,8],[40,9,40,14],[47,1,47,2],[48,1,48,14],[50,1,50,14],[41,3,41,8],[41,9,41,14],[42,3,42,8],[42,9,42,14],[43,3,43,8],[43,9,43,14],[44,3,44,8],[44,9,44,14],[45,3,45,8],[45,9,45,14],[46,3,46,8],[46,9,46,14],[52,3,52,5],[52,6,52,8],[52,9,52,11],[52,12,52,14],[55,3,55,5],[55,6,55,8],[55,9,55,11],[55,12,55,14],[56,3,56,5],[56,6,56,8],[56,9,56,11],[56,12,56,14],[53,3,53,5],[53,6,53,8],[53,9,53,11],[53,12,53,14],[54,3,54,5],[54,6,54,8],[54,9,54,11],[54,12,54,14],[60,1,60,14],[61,3,61,14],[62,3,62,14],[63,3,63,14],[64,1,64,2],[64,3,64,14],[57,1,57,2],[57,3,57,8],[57,9,57,14],[58,1,58,14],[59,1,59,2],[59,3,59,14],[69,3,69,14],[70,1,70,14],[71,1,71,2],[71,3,71,14],[65,1,65,14],[66,1,66,2],[66,3,66,14],[67,3,67,14],[68,3,68,14]]}
[3]
[null,"Lane Support Systems"]
[]
[null,{"$f":"'General Overview'!G16","v":""}]
[null,"SYSTEM DETAILS"]
[null,null,"System Name"]
[null,null,"Default ON (partly)"]
[null,null,"Functionality"]
[null,null,"Speed range (km/h) - Minimum"]
[null,null,"Maximum"]
[]
[null,"PREREQUISITES"]
[null,null,"ESC meeting R13H"]
[null,"PREREQUISITES",null,{"$f":"IF(AND(D13=\"YES\"),\"PASS\",\"FAIL\")","v":"FAIL"}]
[]
[null,"Emergency Lane Keeping"]
[null,null,"Road Edge","No line",null,null,"Center line",null,null,"Center & Dashed line",null,null,"Center & Solid line"]
[null,null,0.2]
[null,null,0.3]
[null,null,0.4]
[null,null,0.5]
[null,null,null,{"$f":"IF(OR(COUNTIF(D18:F21,\">=-0.1\")=4,COUNTIF(D18:F21,\">=-0,1\")=4),0.25,0)","v":0},null,null,{"$f":"IF(OR(COUNTIF(G18:I21,\">=-0.1\")=4,COUNTIF(G18:I21,\">=-0,1\")=4),0.25,0)","v":0},null,null,{"$f":"IF(OR(COUNTIF(J18:L21,\">=-0.1\")=4,COUNTIF(J18:L21,\">=-0,1\")=4),0.25,0)","v":0},null,null,{"$f":"IF(OR(COUNTIF(M18:O21,\">=-0.1\")=4,COUNTIF(M18:O21,\">=-0,1\")=4),0.25,0)","v":0}]
[null,"ELK Road Edge assessment",null,{"$f":"SUM(D22:O22)","v":0}]
[null,null,"Solid Line","Driver side",null,null,null,null,null,"Passenger side"]
[null,null,0.2]
[null,null,0.3]
[null,null,0.4]
[null,null,0.5]
[null,"Solid Line assessment",null,{"$f":"IF(OR(COUNTIF(D25:O28,\">=-0.3\")=8,COUNTIF(D25:O28,\">=-0,3\")=8),0.5,0)","v":0}]
[null,null,"Oncoming vehicle"]
[null,null,0.3]
[null,null,0.4]
[null,null,0.5]
[null,null,0.6]
[null,"ELK Oncoming vehicle assessment",null,{"$f":"IF(COUNTIF(D31:O34,\"PASS\")=4,1,0)","v":0}]
[null,null,"Overtaking vehicle (GVT @ 72km/h)","Unintentional",null,null,null,null,null,"Intentional"]
[null,null,0.3]
[null,null,0.4]
[null,null,0.5]
[null,null,0.6]
[null,null,0.7]
[null,null,"Overtaking vehicle (GVT @ 80km/h)"]
[null,null,0.3]
[null,null,0.4]
[null,null,0.5]
[null,null,0.6]
[null,null,0.7]
[null,"ELK Overtaking vehicle assessment",null,{"$f":"IF(COUNTIF(D37:O47,\"PASS\")=14,0.5,0)","v":0}]
[]
[null,"ELK RESULT",null,{"$f":"SUM(D23,D29,D35,D48)","v":0}]
[]
[null,"Lane Keep Assist",null,"Dashed Line",null,null,null,null,null,"Solid Line"]
[null,null,null,"Driver side",null,null,"Passenger side",null,null,"Driver side",null,null,"Passenger side"]
[null,null,0.2]
[null,null,0.3]
[null,null,0.4]
[null,null,0.5]
[null,"LKA assessment",null,{"$f":"IF(OR(COUNTIF(D54:I57,\">=-0.3\")=8,COUNTIF(D54:I57,\">=-0,3\")=8),0.25,0)","v":0},null,null,null,null,null,{"$f":"IF(OR(COUNTIF(J54:O57,\">=-0.3\")=8,COUNTIF(J54:O57,\">=-0,3\")=8),0.25,0)","v":0}]
[]
[null,"LKA RESULT",null,{"$f":"SUM(D58,J58)","v":0}]
[]
[null,"HMI"]
[null,1,"Lane Departure Warning","FAIL"]
[null,2,"Blind Spot Monitoring","FAIL"]
[null,"HMI RESULT",null,{"$f":"IF(OR(D63=\"PASS\",D64=\"PASS\"),0.5,0)","v":0}]
[]
[null,"SUMMARY"]
[null,null,"ELK",{"$f":"D50","v":0}]
[null,null,"LKA",{"$f":"D60","v":0}]
[null,null,"HMI",{"$f":"D65","v":0}]
[]
[null,"TOTAL Lane Support Systems",null,{"$f":"IF(D14=\"FAIL\",0,ROUND(SUM(D68:O70),Round))","v":0}]

{"sheet":"Datasheet","index":21,"n_rows":350,"n_cols":33,"rows_kept":350,"cut":false,"hidden":false,"merged":[[326,31,326,32],[326,28,326,29]]}
[null,"Reference Number",100]
[null,"Active bonnet",{"$f":"IF(OR('General Overview'!E51:E52=\"Standard\"),\"Standard\",IF(OR('General Overview'!E51:E52=\"Optional meeting fitment\"),\"Optional meeting fitment\",IF(OR('General Overview'!E51:E52=\"Optional not meeting fitment\"),\"Optional not meeting fitment\",\"Not available\")))","v":"Not available"}]
[null,"AEB-VRU fitment",{"$f":"IF(OR('General Overview'!E54:E55=\"Standard\"),\"Standard\",IF(OR('General Overview'!E54:E55=\"Optional meeting fitment\"),\"Optional meeting fitment\",IF(OR('General Overview'!E54:E55=\"Optional not meeting fitment\"),\"Optional not meeting fitment\",\"Not available\")))","v":"Not available"}]
[null,"MPDB Image type",{"$f":"IF(NOT(ISERROR(FIND(\"Off-Road\",'General Overview'!C19))),\"SUV\",\"Car\")","v":"Car"}]
[]
[]
[null,"Frontal Points",{"$f":"ROUND('OVERALL RATING'!D7+'OVERALL RATING'!D8,1)","v":{"$error":"#NAME?"}}]
[null,"Frontal Max Points",{"$f":"SUM(C33,C43)","v":16}]
[null,"Frontal Colour",{"$f":"IF(C7/C8>0.75,\"Green\",IF(C7/C8>0.5,\"Yellow\",IF(C7/C8>0.25,\"Orange\",IF(C7/C8>0,\"Brown\",\"Red\"))))","v":{"$error":"#NAME?"}}]
[null,"Lateral Points",{"$f":"ROUND('OVERALL RATING'!D9+'OVERALL RATING'!D10+'OVERALL RATING'!D11,1)","v":{"$error":"#NAME?"}}]
[null,"Lateral Max Points",{"$f":"C59+C51+C69","v":16}]
[null,"Lateral Colour",{"$f":"IF(C10/C11>0.75,\"Green\",IF(C10/C11>0.5,\"Yellow\",IF(C10/C11>0.25,\"Orange\",IF(C10/C11>0,\"Brown\",\"Red\"))))","v":{"$error":"#NAME?"}}]
[null,"Rear Points",{"$f":"ROUND('OVERALL RATING'!D12,1)","v":{"$error":"#NAME?"}}]
[null,"Rear Max Points",{"$f":"C73","v":4}]
[null,"Rear Colour",{"$f":"IF(C13/C14>0.75,\"Green\",IF(C13/C14>0.5,\"Yellow\",IF(C13/C14>0.25,\"Orange\",IF(C13/C14>0,\"Brown\",\"Red\"))))","v":{"$error":"#NAME?"}}]
[]
[]
[]
[null,null,null,null,null,null,null,null,"MPDB Deformations",null,null,null,null,null,null,null,null,"MPDB Deformation Colours"]
[null,null,null,null,null,null,null,null,null,{"$f":"'AOP Frontal MPDB'!E119","v":"Enter X-deformation"},"Col_1","Col_2","Col_3","Col_4","Col_5","Col_6",null,{"$f":"'AOP Frontal MPDB'!M133","v":0}]
[null,"MPDB",null,"Driver",null,"Passenger",null,null,null,"Nr cells averaged",{"$f":"IF(6*CEILING(('AOP Frontal MPDB'!$N$139-'AOP Frontal MPDB'!$M$139+1)/6,1)-('AOP Frontal MPDB'!$N$139-'AOP Frontal MPDB'!$M$139+1)>=1,FLOOR(('AOP Frontal MPDB'!$N$139-'AOP Frontal MPDB'!$M$139+1)/6,1),CEILING(('AOP Frontal MPDB'!$N$139-'AOP Frontal MPDB'!$M$139+1)/6,1))","v":-2},{"$f":"IF(6*CEILING(('AOP Frontal MPDB'!$N$139-'AOP Frontal MPDB'!$M$139+1)/6,1)-('AOP Frontal MPDB'!$N$139-'AOP Frontal MPDB'!$M$139+1)>=3,FLOOR(('AOP Frontal MPDB'!$N$139-'AOP Frontal MPDB'!$M$139+1)/6,1),CEILING(('AOP Frontal MPDB'!$N$139-'AOP Frontal MPDB'!$M$139+1)/6,1))","v":-2},{"$f":"IF(6*CEILING(('AOP Frontal MPDB'!$N$139-'AOP Frontal MPDB'!$M$139+1)/6,1)-('AOP Frontal MPDB'!$N$139-'AOP Frontal MPDB'!$M$139+1)>=5,FLOOR(('AOP Frontal MPDB'!$N$139-'AOP Frontal MPDB'!$M$139+1)/6,1),CEILING(('AOP Frontal MPDB'!$N$139-'AOP Frontal MPDB'!$M$139+1)/6,1))","v":-1},{"$f":"IF(6*CEILING(('AOP Frontal MPDB'!$N$139-'AOP Frontal MPDB'!$M$139+1)/6,1)-('AOP Frontal MPDB'!$N$139-'AOP Frontal MPDB'!$M$139+1)>=6,FLOOR(('AOP Frontal MPDB'!$N$139-'AOP Frontal MPDB'!$M$139+1)/6,1),CEILING(('AOP Frontal MPDB'!$N$139-'AOP Frontal MPDB'!$M$139+1)/6,1))","v":-1},{"$f":"IF(6*CEILING(('AOP Frontal MPDB'!$N$139-'AOP Frontal MPDB'!$M$139+1)/6,1)-('AOP Frontal MPDB'!$N$139-'AOP Frontal MPDB'!$M$139+1)>=4,FLOOR(('AOP Frontal MPDB'!$N$139-'AOP Frontal MPDB'!$M$139+1)/6,1),CEILING(('AOP Frontal MPDB'!$N$139-'AOP Frontal MPDB'!$M$139+1)/6,1))","v":-2},{"$f":"IF(6*CEILING(('AOP Frontal MPDB'!$N$139-'AOP Frontal MPDB'!$M$139+1)/6,1)-('AOP Frontal MPDB'!$N$139-'AOP Frontal MPDB'!$M$139+1)>=2,FLOOR(('AOP Frontal MPDB'!$N$139-'AOP Frontal MPDB'!$M$139+1)/6,1),CEILING(('AOP Frontal MPDB'!$N$139-'AOP Frontal MPDB'!$M$139+1)/6,1))","v":-2},null,null,"Col_1","Col_2","Col_3","Col_4","Col_5","Col_6"]
[null,"Head colour",null,{"$f":"IF('AOP Frontal MPDB'!E23=4,\"Green\",IF('AOP Frontal MPDB'!E23>=2.67,\"Yellow\",IF('AOP Frontal MPDB'!E23>=1.33,\"Orange\",IF('AOP Frontal MPDB'!E23>0,\"Brown\",\"Red\"))))","v":"Red"},null,{"$f":"IF('AOP Frontal MPDB'!G23=4,\"Green\",IF('AOP Frontal MPDB'!G23>=2.67,\"Yellow\",IF('AOP Frontal MPDB'!G23>=1.33,\"Orange\",IF('AOP Frontal MPDB'!G23>0,\"Brown\",\"Red\"))))","v":"Red"},null,null,"Row_7",3,{"$f":"IF(J20=\"Enter X-deformation\",999,AVERAGEIFS('AOP Frontal MPDB'!$N$144:$N$1543,'AOP Frontal MPDB'!$L$144:$L$1543,\">=\"&'AOP Frontal MPDB'!$M$139,'AOP Frontal MPDB'!$L$144:$L$1543,\"<\"&'AOP Frontal MPDB'!$M$139+SUM($J$21:K$21),'AOP Frontal MPDB'!$K$144:$K$1543,\"<=\"&'AOP Frontal MPDB'!$I$140,'AOP Frontal MPDB'!$K$144:$K$1543,\">\"&'AOP Frontal MPDB'!$I$140-SUM($J$21:$J22)))","v":999},{"$f":"IF(J20=\"Enter X-deformation\",999,AVERAGEIFS('AOP Frontal MPDB'!$N$144:$N$1543,'AOP Frontal MPDB'!$L$144:$L$1543,\">=\"&'AOP Frontal MPDB'!$M$139+K21,'AOP Frontal MPDB'!$L$144:$L$1543,\"<\"&'AOP Frontal MPDB'!$M$139+SUM($K$21:L21),'AOP Frontal MPDB'!$K$144:$K$1543,\"<=\"&'AOP Frontal MPDB'!$I$140,'AOP Frontal MPDB'!$K$144:$K$1543,\">\"&'AOP Frontal MPDB'!$I$140-4))","v":999},{"$f":"IF($J$20=\"Enter X-deformation\",999,AVERAGEIFS('AOP Frontal MPDB'!$N$144:$N$1543,'AOP Frontal MPDB'!$L$144:$L$1543,\">=\"&'AOP Frontal MPDB'!$M$139+SUM($K$21:L21),'AOP Frontal MPDB'!$L$144:$L$1543,\"<\"&'AOP Frontal MPDB'!$M$139+SUM($K$21:M21),'AOP Frontal MPDB'!$K$144:$K$1543,\"<=\"&'AOP Frontal MPDB'!$I$140,'AOP Frontal MPDB'!$K$144:$K$1543,\">\"&'AOP Frontal MPDB'!$I$140-4))","v":999},{"$f":"IF($J$20=\"Enter X-deformation\",999,AVERAGEIFS('AOP Frontal MPDB'!$N$144:$N$1543,'AOP Frontal MPDB'!$L$144:$L$1543,\">=\"&'AOP Frontal MPDB'!$M$139+SUM($K$21:M21),'AOP Frontal MPDB'!$L$144:$L$1543,\"<\"&'AOP Frontal MPDB'!$M$139+SUM($K$21:N21),'AOP Frontal MPDB'!$K$144:$K$1543,\"<=\"&'AOP Frontal MPDB'!$I$140,'AOP Frontal MPDB'!$K$144:$K$1543,\">\"&'AOP Frontal MPDB'!$I$140-4))","v":999},{"$f":"IF($J$20=\"Enter X-deformation\",999,AVERAGEIFS('AOP Frontal MPDB'!$N$144:$N$1543,'AOP Frontal MPDB'!$L$144:$L$1543,\">=\"&'AOP Frontal MPDB'!$M$139+SUM($K$21:N21),'AOP Frontal MPDB'!$L$144:$L$1543,\"<\"&'AOP Frontal MPDB'!$M$139+SUM($K$21:O21),'AOP Frontal MPDB'!$K$144:$K$1543,\"<=\"&'AOP Frontal MPDB'!$I$140,'AOP Frontal MPDB'!$K$144:$K$1543,\">\"&'AOP Frontal MPDB'!$I$140-4))","v":999},{"$f":"IF($J$20=\"Enter X-deformation\",999,AVERAGEIFS('AOP Frontal MPDB'!$N$144:$N$1543,'AOP Frontal MPDB'!$L$144:$L$1543,\">=\"&'AOP Frontal MPDB'!$M$139+SUM($K$21:O21),'AOP Frontal MPDB'!$L$144:$L$1543,\"<\"&'AOP Frontal MPDB'!$M$139+SUM($K$21:P21),'AOP Frontal MPDB'!$K$144:$K$1543,\"<=\"&'AOP Frontal MPDB'!$I$140,'AOP Frontal MPDB'!$K$144:$K$1543,\">\"&'AOP Frontal MPDB'!$I$140-4))","v":999},null,"Row_7",{"$f":"IF($R$20=\"RHD\",IF(K22<160,\"Green\",IF(K22<320,\"Yellow\",IF(K22<480,\"Orange\",IF(K22<630,\"Brown\",\"Red\")))),IF(P22<160,\"Green\",IF(P22<320,\"Yellow\",IF(P22<480,\"Orange\",IF(P22<630,\"Brown\",\"Red\")))))","v":"Red"},{"$f":"IF($R$20=\"RHD\",IF(L22<160,\"Green\",IF(L22<320,\"Yellow\",IF(L22<480,\"Orange\",IF(L22<630,\"Brown\",\"Red\")))),IF(O22<160,\"Green\",IF(O22<320,\"Yellow\",IF(O22<480,\"Orange\",IF(O22<630,\"Brown\",\"Red\")))))","v":"Red"},{"$f":"IF($R$20=\"RHD\",IF(M22<160,\"Green\",IF(M22<320,\"Yellow\",IF(M22<480,\"Orange\",IF(M22<630,\"Brown\",\"Red\")))),IF(N22<160,\"Green\",IF(N22<320,\"Yellow\",IF(N22<480,\"Orange\",IF(N22<630,\"Brown\",\"Red\")))))","v":"Red"},{"$f":"IF($R$20=\"RHD\",IF(N22<160,\"Green\",IF(N22<320,\"Yellow\",IF(N22<480,\"Orange\",IF(N22<630,\"Brown\",\"Red\")))),IF(M22<160,\"Green\",IF(M22<320,\"Yellow\",IF(M22<480,\"Orange\",IF(M22<630,\"Brown\",\"Red\")))))","v":"Red"},{"$f":"IF($R$20=\"RHD\",IF(O22<160,\"Green\",IF(O22<320,\"Yellow\",IF(O22<480,\"Orange\",IF(O22<630,\"Brown\",\"Red\")))),IF(L22<160,\"Green\",IF(L22<320,\"Yellow\",IF(L22<480,\"Orange\",IF(L22<630,\"Brown\",\"Red\")))))","v":"Red"},{"$f":"IF($R$20=\"RHD\",IF(P22<160,\"Green\",IF(P22<320,\"Yellow\",IF(P22<480,\"Orange\",IF(P22<630,\"Brown\",\"Red\")))),IF(K22<160,\"Green\",IF(K22<320,\"Yellow\",IF(K22<480,\"Orange\",IF(K22<630,\"Brown\",\"Red\")))))","v":"Red"}]
[null,"Neck Colour",null,{"$f":"IF('AOP Frontal MPDB'!E31=4,\"Green\",IF('AOP Frontal MPDB'!E31>=2.67,\"Yellow\",IF('AOP Frontal MPDB'!E31>=1.33,\"Orange\",IF('AOP Frontal MPDB'!E31>0,\"Brown\",\"Red\"))))","v":{"$error":"#NAME?"}},null,{"$f":"IF('AOP Frontal MPDB'!G31=4,\"Green\",IF('AOP Frontal MPDB'!G31>=2.67,\"Yellow\",IF('AOP Frontal MPDB'!G31>=1.33,\"Orange\",IF('AOP Frontal MPDB'!G31>0,\"Brown\",\"Red\"))))","v":{"$error":"#NAME?"}},null,null,"Row_6",3,{"$f":"IF(J20=\"Enter X-deformation\",999,AVERAGEIFS('AOP Frontal MPDB'!$N$144:$N$1543,'AOP Frontal MPDB'!$L$144:$L$1543,\">=\"&'AOP Frontal MPDB'!$M$139,'AOP Frontal MPDB'!$L$144:$L$1543,\"<\"&'AOP Frontal MPDB'!$M$139+SUM($J$21:K$21),'AOP Frontal MPDB'!$K$144:$K$1543,\"<=\"&'AOP Frontal MPDB'!$I$140-SUM($J$21:$J22),'AOP Frontal MPDB'!$K$144:$K$1543,\">\"&'AOP Frontal MPDB'!$I$140-SUM($J$21:$J23)))","v":999},{"$f":"IF(J20=\"Enter X-deformation\",999,AVERAGEIFS('AOP Frontal MPDB'!$N$144:$N$1543,'AOP Frontal MPDB'!$L$144:$L$1543,\">=\"&'AOP Frontal MPDB'!$M$139+SUM($J$21:K$21),'AOP Frontal MPDB'!$L$144:$L$1543,\"<\"&'AOP Frontal MPDB'!$M$139+SUM($J$21:L$21),'AOP Frontal MPDB'!$K$144:$K$1543,\"<=\"&'AOP Frontal MPDB'!$I$140-SUM($J$21:$J22),'AOP Frontal MPDB'!$K$144:$K$1543,\">\"&'AOP Frontal MPDB'!$I$140-SUM($J$21:$J23)))","v":999},{"$f":"IF($J$20=\"Enter X-deformation\",999,AVERAGEIFS('AOP Frontal MPDB'!$N$144:$N$1543,'AOP Frontal MPDB'!$L$144:$L$1543,\">=\"&'AOP Frontal MPDB'!$M$139+SUM($J$21:L$21),'AOP Frontal MPDB'!$L$144:$L$1543,\"<\"&'AOP Frontal MPDB'!$M$139+SUM($J$21:M$21),'AOP Frontal MPDB'!$K$144:$K$1543,\"<=\"&'AOP Frontal MPDB'!$I$140-SUM($J$21:$J22),'AOP Frontal MPDB'!$K$144:$K$1543,\">\"&'AOP Frontal MPDB'!$I$140-SUM($J$21:$J23)))","v":999},{"$f":"IF($J$20=\"Enter X-deformation\",999,AVERAGEIFS('AOP Frontal MPDB'!$N$144:$N$1543,'AOP Frontal MPDB'!$L$144:$L$1543,\">=\"&'AOP Frontal MPDB'!$M$139+SUM($J$21:M$21),'AOP Frontal MPDB'!$L$144:$L$1543,\"<\"&'AOP Frontal MPDB'!$M$139+SUM($J$21:N$21),'AOP Frontal MPDB'!$K$144:$K$1543,\"<=\"&'AOP Frontal MPDB'!$I$140-SUM($J$21:$J22),'AOP Frontal MPDB'!$K$144:$K$1543,\">\"&'AOP Frontal MPDB'!$I$140-SUM($J$21:$J23)))","v":999},{"$f":"IF($J$20=\"Enter X-deformation\",999,AVERAGEIFS('AOP Frontal MPDB'!$N$144:$N$1543,'AOP Frontal MPDB'!$L$144:$L$1543,\">=\"&'AOP Frontal MPDB'!$M$139+SUM($J$21:N$21),'AOP Frontal MPDB'!$L$144:$L$1543,\"<\"&'AOP Frontal MPDB'!$M$139+SUM($J$21:O$21),'AOP Frontal MPDB'!$K$144:$K$1543,\"<=\"&'AOP Frontal MPDB'!$I$140-SUM($J$21:$J22),'AOP Frontal MPDB'!$K$144:$K$1543,\">\"&'AOP Frontal MPDB'!$I$140-SUM($J$21:$J23)))","v":999},{"$f":"IF($J$20=\"Enter X-deformation\",999,AVERAGEIFS('AOP Frontal MPDB'!$N$144:$N$1543,'AOP Frontal MPDB'!$L$144:$L$1543,\">=\"&'AOP Frontal MPDB'!$M$139+SUM($J$21:O$21),'AOP Frontal MPDB'!$L$144:$L$1543,\"<\"&'AOP Frontal MPDB'!$M$139+SUM($J$21:P$21),'AOP Frontal MPDB'!$K$144:$K$1543,\"<=\"&'AOP Frontal MPDB'!$I$140-SUM($J$21:$J22),'AOP Frontal MPDB'!$K$144:$K$1543,\">\"&'AOP Frontal MPDB'!$I$140-SUM($J$21:$J23)))","v":999},null,"Row_6","Red","Red","Red","Red","Red","Red"]
[null,"Chest Colour",null,{"$f":"IF('AOP Frontal MPDB'!E49=4,\"Green\",IF('AOP Frontal MPDB'!E49>=2.67,\"Yellow\",IF('AOP Frontal MPDB'!E49>=1.33,\"Orange\",IF('AOP Frontal MPDB'!E49>0,\"Brown\",\"Red\"))))","v":{"$error":"#NAME?"}},null,{"$f":"IF('AOP Frontal MPDB'!G49=4,\"Green\",IF('AOP Frontal MPDB'!G49>=2.67,\"Yellow\",IF('AOP Frontal MPDB'!G49>=1.33,\"Orange\",IF('AOP Frontal MPDB'!G49>0,\"Brown\",\"Red\"))))","v":{"$error":"#NAME?"}},null,null,"Row_5",3,{"$f":"IF(J20=\"Enter X-deformation\",999,AVERAGEIFS('AOP Frontal MPDB'!$N$144:$N$1543,'AOP Frontal MPDB'!$L$144:$L$1543,\">=\"&'AOP Frontal MPDB'!$M$139,'AOP Frontal MPDB'!$L$144:$L$1543,\"<\"&'AOP Frontal MPDB'!$M$139+SUM($J$21:K$21),'AOP Frontal MPDB'!$K$144:$K$1543,\"<=\"&'AOP Frontal MPDB'!$I$140-SUM($J$21:$J23),'AOP Frontal MPDB'!$K$144:$K$1543,\">\"&'AOP Frontal MPDB'!$I$140-SUM($J$21:$J24)))","v":999},{"$f":"IF(J20=\"Enter X-deformation\",999,AVERAGEIFS('AOP Frontal MPDB'!$N$144:$N$1543,'AOP Frontal MPDB'!$L$144:$L$1543,\">=\"&'AOP Frontal MPDB'!$M$139+SUM($J$21:K$21),'AOP Frontal MPDB'!$L$144:$L$1543,\"<\"&'AOP Frontal MPDB'!$M$139+SUM($J$21:L$21),'AOP Frontal MPDB'!$K$144:$K$1543,\"<=\"&'AOP Frontal MPDB'!$I$140-SUM($J$21:$J23),'AOP Frontal MPDB'!$K$144:$K$1543,\">\"&'AOP Frontal MPDB'!$I$140-SUM($J$21:$J24)))","v":999},{"$f":"IF($J$20=\"Enter X-deformation\",999,AVERAGEIFS('AOP Frontal MPDB'!$N$144:$N$1543,'AOP Frontal MPDB'!$L$144:$L$1543,\">=\"&'AOP Frontal MPDB'!$M$139+SUM($J$21:L$21),'AOP Frontal MPDB'!$L$144:$L$1543,\"<\"&'AOP Frontal MPDB'!$M$139+SUM($J$21:M$21),'AOP Frontal MPDB'!$K$144:$K$1543,\"<=\"&'AOP Frontal MPDB'!$I$140-SUM($J$21:$J23),'AOP Frontal MPDB'!$K$144:$K$1543,\">\"&'AOP Frontal MPDB'!$I$140-SUM($J$21:$J24)))","v":999},{"$f":"IF($J$20=\"Enter X-deformation\",999,AVERAGEIFS('AOP Frontal MPDB'!$N$144:$N$1543,'AOP Frontal MPDB'!$L$144:$L$1543,\">=\"&'AOP Frontal MPDB'!$M$139+SUM($J$21:M$21),'AOP Frontal MPDB'!$L$144:$L$1543,\"<\"&'AOP Frontal MPDB'!$M$139+SUM($J$21:N$21),'AOP Frontal MPDB'!$K$144:$K$1543,\"<=\"&'AOP Frontal MPDB'!$I$140-SUM($J$21:$J23),'AOP Frontal MPDB'!$K$144:$K$1543,\">\"&'AOP Frontal MPDB'!$I$140-SUM($J$21:$J24)))","v":999},{"$f":"IF($J$20=\"Enter X-deformation\",999,AVERAGEIFS('AOP Frontal MPDB'!$N$144:$N$1543,'AOP Frontal MPDB'!$L$144:$L$1543,\">=\"&'AOP Frontal MPDB'!$M$139+SUM($J$21:N$21),'AOP Frontal MPDB'!$L$144:$L$1543,\"<\"&'AOP Frontal MPDB'!$M$139+SUM($J$21:O$21),'AOP Frontal MPDB'!$K$144:$K$1543,\"<=\"&'AOP Frontal MPDB'!$I$140-SUM($J$21:$J23),'AOP Frontal MPDB'!$K$144:$K$1543,\">\"&'AOP Frontal MPDB'!$I$140-SUM($J$21:$J24)))","v":999},{"$f":"IF($J$20=\"Enter X-deformation\",999,AVERAGEIFS('AOP Frontal MPDB'!$N$144:$N$1543,'AOP Frontal MPDB'!$L$144:$L$1543,\">=\"&'AOP Frontal MPDB'!$M$139+SUM($J$21:O$21),'AOP Frontal MPDB'!$L$144:$L$1543,\"<\"&'AOP Frontal MPDB'!$M$139+SUM($J$21:P$21),'AOP Frontal MPDB'!$K$144:$K$1543,\"<=\"&'AOP Frontal MPDB'!$I$140-SUM($J$21:$J23),'AOP Frontal MPDB'!$K$144:$K$1543,\">\"&'AOP Frontal MPDB'!$I$140-SUM($J$21:$J24)))","v":999},null,"Row_5","Red","Red","Red","Red","Red","Red"]
[null,"Abdomen",null,{"$f":"IF('AOP Frontal MPDB'!E53=4,\"Green\",IF('AOP Frontal MPDB'!E53>=2.67,\"Yellow\",IF('AOP Frontal MPDB'!E53>=1.33,\"Orange\",IF('AOP Frontal MPDB'!E53>0,\"Brown\",\"Red\"))))","v":"Red"},null,null,null,null,"Row_4",2,{"$f":"IF(J20=\"Enter X-deformation\",999,AVERAGEIFS('AOP Frontal MPDB'!$N$144:$N$1543,'AOP Frontal MPDB'!$L$144:$L$1543,\">=\"&'AOP Frontal MPDB'!$M$139,'AOP Frontal MPDB'!$L$144:$L$1543,\"<\"&'AOP Frontal MPDB'!$M$139+SUM($J$21:K$21),'AOP Frontal MPDB'!$K$144:$K$1543,\"<=\"&'AOP Frontal MPDB'!$I$140-SUM($J$21:$J24),'AOP Frontal MPDB'!$K$144:$K$1543,\">\"&'AOP Frontal MPDB'!$I$140-SUM($J$21:$J25)))","v":999},{"$f":"IF(J20=\"Enter X-deformation\",999,AVERAGEIFS('AOP Frontal MPDB'!$N$144:$N$1543,'AOP Frontal MPDB'!$L$144:$L$1543,\">=\"&'AOP Frontal MPDB'!$M$139+SUM($J$21:K$21),'AOP Frontal MPDB'!$L$144:$L$1543,\"<\"&'AOP Frontal MPDB'!$M$139+SUM($J$21:L$21),'AOP Frontal MPDB'!$K$144:$K$1543,\"<=\"&'AOP Frontal MPDB'!$I$140-SUM($J$21:$J24),'AOP Frontal MPDB'!$K$144:$K$1543,\">\"&'AOP Frontal MPDB'!$I$140-SUM($J$21:$J25)))","v":999},{"$f":"IF($J$20=\"Enter X-deformation\",999,AVERAGEIFS('AOP Frontal MPDB'!$N$144:$N$1543,'AOP Frontal MPDB'!$L$144:$L$1543,\">=\"&'AOP Frontal MPDB'!$M$139+SUM($J$21:L$21),'AOP Frontal MPDB'!$L$144:$L$1543,\"<\"&'AOP Frontal MPDB'!$M$139+SUM($J$21:M$21),'AOP Frontal MPDB'!$K$144:$K$1543,\"<=\"&'AOP Frontal MPDB'!$I$140-SUM($J$21:$J24),'AOP Frontal MPDB'!$K$144:$K$1543,\">\"&'AOP Frontal MPDB'!$I$140-SUM($J$21:$J25)))","v":999},{"$f":"IF($J$20=\"Enter X-deformation\",999,AVERAGEIFS('AOP Frontal MPDB'!$N$144:$N$1543,'AOP Frontal MPDB'!$L$144:$L$1543,\">=\"&'AOP Frontal MPDB'!$M$139+SUM($J$21:M$21),'AOP Frontal MPDB'!$L$144:$L$1543,\"<\"&'AOP Frontal MPDB'!$M$139+SUM($J$21:N$21),'AOP Frontal MPDB'!$K$144:$K$1543,\"<=\"&'AOP Frontal MPDB'!$I$140-SUM($J$21:$J24),'AOP Frontal MPDB'!$K$144:$K$1543,\">\"&'AOP Frontal MPDB'!$I$140-SUM($J$21:$J25)))","v":999},{"$f":"IF($J$20=\"Enter X-deformation\",999,AVERAGEIFS('AOP Frontal MPDB'!$N$144:$N$1543,'AOP Frontal MPDB'!$L$144:$L$1543,\">=\"&'AOP Frontal MPDB'!$M$139+SUM($J$21:N$21),'AOP Frontal MPDB'!$L$144:$L$1543,\"<\"&'AOP Frontal MPDB'!$M$139+SUM($J$21:O$21),'AOP Frontal MPDB'!$K$144:$K$1543,\"<=\"&'AOP Frontal MPDB'!$I$140-SUM($J$21:$J24),'AOP Frontal MPDB'!$K$144:$K$1543,\">\"&'AOP Frontal MPDB'!$I$140-SUM($J$21:$J25)))","v":999},{"$f":"IF($J$20=\"Enter X-deformation\",999,AVERAGEIFS('AOP Frontal MPDB'!$N$144:$N$1543,'AOP Frontal MPDB'!$L$144:$L$1543,\">=\"&'AOP Frontal MPDB'!$M$139+SUM($J$21:O$21),'AOP Frontal MPDB'!$L$144:$L$1543,\"<\"&'AOP Frontal MPDB'!$M$139+SUM($J$21:P$21),'AOP Frontal MPDB'!$K$144:$K$1543,\"<=\"&'AOP Frontal MPDB'!$I$140-SUM($J$21:$J24),'AOP Frontal MPDB'!$K$144:$K$1543,\">\"&'AOP Frontal MPDB'!$I$140-SUM($J$21:$J25)))","v":999},null,"Row_4","Red","Red","Red","Red","Red","Red"]
[null,"Pelvis",null,{"$f":"IF('AOP Frontal MPDB'!E75=4,\"Green\",IF('AOP Frontal MPDB'!E75>=2.67,\"Yellow\",IF('AOP Frontal MPDB'!E75>=1.33,\"Orange\",IF('AOP Frontal MPDB'!E75>0,\"Brown\",\"Red\"))))","v":{"$error":"#NAME?"}},null,null,null,null,"Row_3",3,{"$f":"IF(J20=\"Enter X-deformation\",999,AVERAGEIFS('AOP Frontal MPDB'!$N$144:$N$1543,'AOP Frontal MPDB'!$L$144:$L$1543,\">=\"&'AOP Frontal MPDB'!$M$139,'AOP Frontal MPDB'!$L$144:$L$1543,\"<\"&'AOP Frontal MPDB'!$M$139+SUM($J$21:K$21),'AOP Frontal MPDB'!$K$144:$K$1543,\"<=\"&'AOP Frontal MPDB'!$I$140-SUM($J$21:$J25),'AOP Frontal MPDB'!$K$144:$K$1543,\">\"&'AOP Frontal MPDB'!$I$140-SUM($J$21:$J26)))","v":999},{"$f":"IF(J20=\"Enter X-deformation\",999,AVERAGEIFS('AOP Frontal MPDB'!$N$144:$N$1543,'AOP Frontal MPDB'!$L$144:$L$1543,\">=\"&'AOP Frontal MPDB'!$M$139+SUM($J$21:K$21),'AOP Frontal MPDB'!$L$144:$L$1543,\"<\"&'AOP Frontal MPDB'!$M$139+SUM($J$21:L$21),'AOP Frontal MPDB'!$K$144:$K$1543,\"<=\"&'AOP Frontal MPDB'!$I$140-SUM($J$21:$J25),'AOP Frontal MPDB'!$K$144:$K$1543,\">\"&'AOP Frontal MPDB'!$I$140-SUM($J$21:$J26)))","v":999},{"$f":"IF($J$20=\"Enter X-deformation\",999,AVERAGEIFS('AOP Frontal MPDB'!$N$144:$N$1543,'AOP Frontal MPDB'!$L$144:$L$1543,\">=\"&'AOP Frontal MPDB'!$M$139+SUM($J$21:L$21),'AOP Frontal MPDB'!$L$144:$L$1543,\"<\"&'AOP Frontal MPDB'!$M$139+SUM($J$21:M$21),'AOP Frontal MPDB'!$K$144:$K$1543,\"<=\"&'AOP Frontal MPDB'!$I$140-SUM($J$21:$J25),'AOP Frontal MPDB'!$K$144:$K$1543,\">\"&'AOP Frontal MPDB'!$I$140-SUM($J$21:$J26)))","v":999},{"$f":"IF($J$20=\"Enter X-deformation\",999,AVERAGEIFS('AOP Frontal MPDB'!$N$144:$N$1543,'AOP Frontal MPDB'!$L$144:$L$1543,\">=\"&'AOP Frontal MPDB'!$M$139+SUM($J$21:M$21),'AOP Frontal MPDB'!$L$144:$L$1543,\"<\"&'AOP Frontal MPDB'!$M$139+SUM($J$21:N$21),'AOP Frontal MPDB'!$K$144:$K$1543,\"<=\"&'AOP Frontal MPDB'!$I$140-SUM($J$21:$J25),'AOP Frontal MPDB'!$K$144:$K$1543,\">\"&'AOP Frontal MPDB'!$I$140-SUM($J$21:$J26)))","v":999},{"$f":"IF($J$20=\"Enter X-deformation\",999,AVERAGEIFS('AOP Frontal MPDB'!$N$144:$N$1543,'AOP Frontal MPDB'!$L$144:$L$1543,\">=\"&'AOP Frontal MPDB'!$M$139+SUM($J$21:N$21),'AOP Frontal MPDB'!$L$144:$L$1543,\"<\"&'AOP Frontal MPDB'!$M$139+SUM($J$21:O$21),'AOP Frontal MPDB'!$K$144:$K$1543,\"<=\"&'AOP Frontal MPDB'!$I$140-SUM($J$21:$J25),'AOP Frontal MPDB'!$K$144:$K$1543,\">\"&'AOP Frontal MPDB'!$I$140-SUM($J$21:$J26)))","v":999},{"$f":"IF($J$20=\"Enter X-deformation\",999,AVERAGEIFS('AOP Frontal MPDB'!$N$144:$N$1543,'AOP Frontal MPDB'!$L$144:$L$1543,\">=\"&'AOP Frontal MPDB'!$M$139+SUM($J$21:O$21),'AOP Frontal MPDB'!$L$144:$L$1543,\"<\"&'AOP Frontal MPDB'!$M$139+SUM($J$21:P$21),'AOP Frontal MPDB'!$K$144:$K$1543,\"<=\"&'AOP Frontal MPDB'!$I$140-SUM($J$21:$J25),'AOP Frontal MPDB'!$K$144:$K$1543,\">\"&'AOP Frontal MPDB'!$I$140-SUM($J$21:$J26)))","v":999},null,"Row_3","Red","Red","Red","Red","Red","Red"]
[null,"KFP - left",null,{"$f":"IF('AOP Frontal MPDB'!E64=4,\"Green\",IF('AOP Frontal MPDB'!E64>=2.67,\"Yellow\",IF('AOP Frontal MPDB'!E64>=1.33,\"Orange\",IF('AOP Frontal MPDB'!E64>0,\"Brown\",\"Red\"))))","v":{"$error":"#NAME?"}},null,{"$f":"IF('AOP Frontal MPDB'!G64=4,\"Green\",IF('AOP Frontal MPDB'!G64>=2.67,\"Yellow\",IF('AOP Frontal MPDB'!G64>=1.33,\"Orange\",IF('AOP Frontal MPDB'!G64>0,\"Brown\",\"Red\"))))","v":{"$error":"#NAME?"}},null,null,"Row_2",3,{"$f":"IF(J20=\"Enter X-deformation\",999,AVERAGEIFS('AOP Frontal MPDB'!$N$144:$N$1543,'AOP Frontal MPDB'!$L$144:$L$1543,\">=\"&'AOP Frontal MPDB'!$M$139,'AOP Frontal MPDB'!$L$144:$L$1543,\"<\"&'AOP Frontal MPDB'!$M$139+SUM($J$21:K$21),'AOP Frontal MPDB'!$K$144:$K$1543,\"<=\"&'AOP Frontal MPDB'!$I$140-SUM($J$21:$J26),'AOP Frontal MPDB'!$K$144:$K$1543,\">\"&'AOP Frontal MPDB'!$I$140-SUM($J$21:$J27)))","v":999},{"$f":"IF(J20=\"Enter X-deformation\",999,AVERAGEIFS('AOP Frontal MPDB'!$N$144:$N$1543,'AOP Frontal MPDB'!$L$144:$L$1543,\">=\"&'AOP Frontal MPDB'!$M$139+SUM($J$21:K$21),'AOP Frontal MPDB'!$L$144:$L$1543,\"<\"&'AOP Frontal MPDB'!$M$139+SUM($J$21:L$21),'AOP Frontal MPDB'!$K$144:$K$1543,\"<=\"&'AOP Frontal MPDB'!$I$140-SUM($J$21:$J26),'AOP Frontal MPDB'!$K$144:$K$1543,\">\"&'AOP Frontal MPDB'!$I$140-SUM($J$21:$J27)))","v":999},{"$f":"IF($J$20=\"Enter X-deformation\",999,AVERAGEIFS('AOP Frontal MPDB'!$N$144:$N$1543,'AOP Frontal MPDB'!$L$144:$L$1543,\">=\"&'AOP Frontal MPDB'!$M$139+SUM($J$21:L$21),'AOP Frontal MPDB'!$L$144:$L$1543,\"<\"&'AOP Frontal MPDB'!$M$139+SUM($J$21:M$21),'AOP Frontal MPDB'!$K$144:$K$1543,\"<=\"&'AOP Frontal MPDB'!$I$140-SUM($J$21:$J26),'AOP Frontal MPDB'!$K$144:$K$1543,\">\"&'AOP Frontal MPDB'!$I$140-SUM($J$21:$J27)))","v":999},{"$f":"IF($J$20=\"Enter X-deformation\",999,AVERAGEIFS('AOP Frontal MPDB'!$N$144:$N$1543,'AOP Frontal MPDB'!$L$144:$L$1543,\">=\"&'AOP Frontal MPDB'!$M$139+SUM($J$21:M$21),'AOP Frontal MPDB'!$L$144:$L$1543,\"<\"&'AOP Frontal MPDB'!$M$139+SUM($J$21:N$21),'AOP Frontal MPDB'!$K$144:$K$1543,\"<=\"&'AOP Frontal MPDB'!$I$140-SUM($J$21:$J26),'AOP Frontal MPDB'!$K$144:$K$1543,\">\"&'AOP Frontal MPDB'!$I$140-SUM($J$21:$J27)))","v":999},{"$f":"IF($J$20=\"Enter X-deformation\",999,AVERAGEIFS('AOP Frontal MPDB'!$N$144:$N$1543,'AOP Frontal MPDB'!$L$144:$L$1543,\">=\"&'AOP Frontal MPDB'!$M$139+SUM($J$21:N$21),'AOP Frontal MPDB'!$L$144:$L$1543,\"<\"&'AOP Frontal MPDB'!$M$139+SUM($J$21:O$21),'AOP Frontal MPDB'!$K$144:$K$1543,\"<=\"&'AOP Frontal MPDB'!$I$140-SUM($J$21:$J26),'AOP Frontal MPDB'!$K$144:$K$1543,\">\"&'AOP Frontal MPDB'!$I$140-SUM($J$21:$J27)))","v":999},{"$f":"IF($J$20=\"Enter X-deformation\",999,AVERAGEIFS('AOP Frontal MPDB'!$N$144:$N$1543,'AOP Frontal MPDB'!$L$144:$L$1543,\">=\"&'AOP Frontal MPDB'!$M$139+SUM($J$21:O$21),'AOP Frontal MPDB'!$L$144:$L$1543,\"<\"&'AOP Frontal MPDB'!$M$139+SUM($J$21:P$21),'AOP Frontal MPDB'!$K$144:$K$1543,\"<=\"&'AOP Frontal MPDB'!$I$140-SUM($J$21:$J26),'AOP Frontal MPDB'!$K$144:$K$1543,\">\"&'AOP Frontal MPDB'!$I$140-SUM($J$21:$J27)))","v":999},null,"Row_2","Red","Red","Red","Red","Red","Red"]
[null,"KFP - right",null,{"$f":"IF('AOP Frontal MPDB'!E71=4,\"Green\",IF('AOP Frontal MPDB'!E71>=2.67,\"Yellow\",IF('AOP Frontal MPDB'!E71>=1.33,\"Orange\",IF('AOP Frontal MPDB'!E71>0,\"Brown\",\"Red\"))))","v":{"$error":"#NAME?"}},null,{"$f":"IF('AOP Frontal MPDB'!G71=4,\"Green\",IF('AOP Frontal MPDB'!G71>=2.67,\"Yellow\",IF('AOP Frontal MPDB'!G71>=1.33,\"Orange\",IF('AOP Frontal MPDB'!G71>0,\"Brown\",\"Red\"))))","v":{"$error":"#NAME?"}},null,null,"Row_1",3,{"$f":"IF(J20=\"Enter X-deformation\",999,AVERAGEIFS('AOP Frontal MPDB'!$N$144:$N$1543,'AOP Frontal MPDB'!$L$144:$L$1543,\">=\"&'AOP Frontal MPDB'!$M$139,'AOP Frontal MPDB'!$L$144:$L$1543,\"<\"&'AOP Frontal MPDB'!$M$139+SUM($J$21:K$21),'AOP Frontal MPDB'!$K$144:$K$1543,\"<=\"&'AOP Frontal MPDB'!$I$140-SUM($J$21:$J27),'AOP Frontal MPDB'!$K$144:$K$1543,\">\"&'AOP Frontal MPDB'!$I$140-SUM($J$21:$J28)))","v":999},{"$f":"IF(J20=\"Enter X-deformation\",999,AVERAGEIFS('AOP Frontal MPDB'!$N$144:$N$1543,'AOP Frontal MPDB'!$L$144:$L$1543,\">=\"&'AOP Frontal MPDB'!$M$139+SUM($J$21:K$21),'AOP Frontal MPDB'!$L$144:$L$1543,\"<\"&'AOP Frontal MPDB'!$M$139+SUM($J$21:L$21),'AOP Frontal MPDB'!$K$144:$K$1543,\"<=\"&'AOP Frontal MPDB'!$I$140-SUM($J$21:$J27),'AOP Frontal MPDB'!$K$144:$K$1543,\">\"&'AOP Frontal MPDB'!$I$140-SUM($J$21:$J28)))","v":999},{"$f":"IF($J$20=\"Enter X-deformation\",999,AVERAGEIFS('AOP Frontal MPDB'!$N$144:$N$1543,'AOP Frontal MPDB'!$L$144:$L$1543,\">=\"&'AOP Frontal MPDB'!$M$139+SUM($J$21:L$21),'AOP Frontal MPDB'!$L$144:$L$1543,\"<\"&'AOP Frontal MPDB'!$M$139+SUM($J$21:M$21),'AOP Frontal MPDB'!$K$144:$K$1543,\"<=\"&'AOP Frontal MPDB'!$I$140-SUM($J$21:$J27),'AOP Frontal MPDB'!$K$144:$K$1543,\">\"&'AOP Frontal MPDB'!$I$140-SUM($J$21:$J28)))","v":999},{"$f":"IF($J$20=\"Enter X-deformation\",999,AVERAGEIFS('AOP Frontal MPDB'!$N$144:$N$1543,'AOP Frontal MPDB'!$L$144:$L$1543,\">=\"&'AOP Frontal MPDB'!$M$139+SUM($J$21:M$21),'AOP Frontal MPDB'!$L$144:$L$1543,\"<\"&'AOP Frontal MPDB'!$M$139+SUM($J$21:N$21),'AOP Frontal MPDB'!$K$144:$K$1543,\"<=\"&'AOP Frontal MPDB'!$I$140-SUM($J$21:$J27),'AOP Frontal MPDB'!$K$144:$K$1543,\">\"&'AOP Frontal MPDB'!$I$140-SUM($J$21:$J28)))","v":999},{"$f":"IF($J$20=\"Enter X-deformation\",999,AVERAGEIFS('AOP Frontal MPDB'!$N$144:$N$1543,'AOP Frontal MPDB'!$L$144:$L$1543,\">=\"&'AOP Frontal MPDB'!$M$139+SUM($J$21:N$21),'AOP Frontal MPDB'!$L$144:$L$1543,\"<\"&'AOP Frontal MPDB'!$M$139+SUM($J$21:O$21),'AOP Frontal MPDB'!$K$144:$K$1543,\"<=\"&'AOP Frontal MPDB'!$I$140-SUM($J$21:$J27),'AOP Frontal MPDB'!$K$144:$K$1543,\">\"&'AOP Frontal MPDB'!$I$140-SUM($J$21:$J28)))","v":999},{"$f":"IF($J$20=\"Enter X-deformation\",999,AVERAGEIFS('AOP Frontal MPDB'!$N$144:$N$1543,'AOP Frontal MPDB'!$L$144:$L$1543,\">=\"&'AOP Frontal MPDB'!$M$139+SUM($J$21:O$21),'AOP Frontal MPDB'!$L$144:$L$1543,\"<\"&'AOP Frontal MPDB'!$M$139+SUM($J$21:P$21),'AOP Frontal MPDB'!$K$144:$K$1543,\"<=\"&'AOP Frontal MPDB'!$I$140-SUM($J$21:$J27),'AOP Frontal MPDB'!$K$144:$K$1543,\">\"&'AOP Frontal MPDB'!$I$140-SUM($J$21:$J28)))","v":999},null,"Row_1","Red","Red","Red","Red","Red","Red"]
[null,"Lower Leg - left",null,{"$f":"IF('AOP Frontal MPDB'!E87=4,\"Green\",IF('AOP Frontal MPDB'!E87>=2.67,\"Yellow\",IF('AOP Frontal MPDB'!E87>=1.33,\"Orange\",IF('AOP Frontal MPDB'!E87>0,\"Brown\",\"Red\"))))","v":{"$error":"#NAME?"}},null,{"$f":"IF('AOP Frontal MPDB'!G87=4,\"Green\",IF('AOP Frontal MPDB'!G87>=2.67,\"Yellow\",IF('AOP Frontal MPDB'!G87>=1.33,\"Orange\",IF('AOP Frontal MPDB'!G87>0,\"Brown\",\"Red\"))))","v":{"$error":"#NAME?"}}]
[null,"Lower Leg - right",null,{"$f":"IF('AOP Frontal MPDB'!E96=4,\"Green\",IF('AOP Frontal MPDB'!E96>=2.67,\"Yellow\",IF('AOP Frontal MPDB'!E96>=1.33,\"Orange\",IF('AOP Frontal MPDB'!E96>0,\"Brown\",\"Red\"))))","v":{"$error":"#NAME?"}},null,{"$f":"IF('AOP Frontal MPDB'!G96=4,\"Green\",IF('AOP Frontal MPDB'!G96>=2.67,\"Yellow\",IF('AOP Frontal MPDB'!G96>=1.33,\"Orange\",IF('AOP Frontal MPDB'!G96>0,\"Brown\",\"Red\"))))","v":{"$error":"#NAME?"}}]
[null,"Foot & Ankle",null,{"$f":"IF('AOP Frontal MPDB'!E105=4,\"Green\",IF('AOP Frontal MPDB'!E105>=2.67,\"Yellow\",IF('AOP Frontal MPDB'!E105>=1.33,\"Orange\",IF('AOP Frontal MPDB'!E105>0,\"Brown\",\"Red\"))))","v":{"$error":"#NAME?"}}]
[null,"Rounded Total",{"$f":"ROUND('AOP Frontal MPDB'!D125,1)","v":{"$error":"#NAME?"}}]
[null,"Max Points",8]
[]
[null,"FW"]
[null,"Head colour",null,{"$f":"IF('AOP Frontal FW'!D14=4,\"Green\",IF('AOP Frontal FW'!D14>=2.67,\"Yellow\",IF('AOP Frontal FW'!D14>=1.33,\"Orange\",IF('AOP Frontal FW'!D14>0,\"Brown\",\"Red\"))))","v":"Red"},null,{"$f":"IF('AOP Frontal FW'!H14=4,\"Green\",IF('AOP Frontal FW'!H14>=2.67,\"Yellow\",IF('AOP Frontal FW'!H14>=1.33,\"Orange\",IF('AOP Frontal FW'!H14>0,\"Brown\",\"Red\"))))","v":{"$error":"#NAME?"}}]
[null,"Neck colour",null,{"$f":"IF('AOP Frontal FW'!D20=4,\"Green\",IF('AOP Frontal FW'!D20>=2.67,\"Yellow\",IF('AOP Frontal FW'!D20>=1.33,\"Orange\",IF('AOP Frontal FW'!D20>0,\"Brown\",\"Red\"))))","v":"Red"},null,{"$f":"IF('AOP Frontal FW'!H20=4,\"Green\",IF('AOP Frontal FW'!H20>=2.67,\"Yellow\",IF('AOP Frontal FW'!H20>=1.33,\"Orange\",IF('AOP Frontal FW'!H20>0,\"Brown\",\"Red\"))))","v":{"$error":"#NAME?"}}]
[null,"Chest colour",null,{"$f":"IF('AOP Frontal FW'!D28=4,\"Green\",IF('AOP Frontal FW'!D28>=2.67,\"Yellow\",IF('AOP Frontal FW'!D28>=1.33,\"Orange\",IF('AOP Frontal FW'!D28>0,\"Brown\",\"Red\"))))","v":{"$error":"#NAME?"}},null,{"$f":"IF('AOP Frontal FW'!H28=4,\"Green\",IF('AOP Frontal FW'!H28>=2.67,\"Yellow\",IF('AOP Frontal FW'!H28>=1.33,\"Orange\",IF('AOP Frontal FW'!H28>0,\"Brown\",\"Red\"))))","v":{"$error":"#NAME?"}}]
[null,"KF - left",null,{"$f":"IF('AOP Frontal FW'!E34=4,\"Green\",IF('AOP Frontal FW'!E34>=2.67,\"Yellow\",IF('AOP Frontal FW'!E34>=1.33,\"Orange\",IF('AOP Frontal FW'!E34>0,\"Brown\",\"Red\"))))","v":{"$error":"#NAME?"}},null,{"$f":"IF('AOP Frontal FW'!I34=4,\"Green\",IF('AOP Frontal FW'!I34>=2.67,\"Yellow\",IF('AOP Frontal FW'!I34>=1.33,\"Orange\",IF('AOP Frontal FW'!I34>0,\"Brown\",\"Red\"))))","v":{"$error":"#NAME?"}}]
[null,"KF - right",null,{"$f":"IF('AOP Frontal FW'!E38=4,\"Green\",IF('AOP Frontal FW'!E38>=2.67,\"Yellow\",IF('AOP Frontal FW'!E38>=1.33,\"Orange\",IF('AOP Frontal FW'!E38>0,\"Brown\",\"Red\"))))","v":{"$error":"#NAME?"}},null,{"$f":"IF('AOP Frontal FW'!I38=4,\"Green\",IF('AOP Frontal FW'!I38>=2.67,\"Yellow\",IF('AOP Frontal FW'!I38>=1.33,\"Orange\",IF('AOP Frontal FW'!I38>0,\"Brown\",\"Red\"))))","v":{"$error":"#NAME?"}}]
[null,"Pelvis colour",null,{"$f":"IF('AOP Frontal FW'!E41=0,\"Green\",IF('AOP Frontal FW'!E41=-4,\"Red\"))","v":"Green"},null,{"$f":"IF('AOP Frontal FW'!I41=0,\"Green\",IF('AOP Frontal FW'!I41=-4,\"Red\"))","v":"Green"}]
[null,"Rounded Total",{"$f":"ROUND('AOP Frontal FW'!D63,1)","v":{"$error":"#NAME?"}}]
[null,"Max Points",8]
[]
[null,"AE-MDB"]
[null,"Head colour",null,{"$f":"IF('AOP Side MDB'!D10=4,\"Green\",IF('AOP Side MDB'!D10>=2.67,\"Yellow\",IF('AOP Side MDB'!D10>=1.33,\"Orange\",IF('AOP Side MDB'!D10>0,\"Brown\",\"Red\"))))","v":{"$error":"#NAME?"}}]
[null,"Chest colour",null,{"$f":"IF('AOP Side MDB'!D26=4,\"Green\",IF('AOP Side MDB'!D26>=2.67,\"Yellow\",IF('AOP Side MDB'!D26>=1.33,\"Orange\",IF('AOP Side MDB'!D26>0,\"Brown\",\"Red\"))))","v":{"$error":"#NAME?"}}]
[null,"Abdomen",null,{"$f":"IF('AOP Side MDB'!D37=4,\"Green\",IF('AOP Side MDB'!D37>=2.67,\"Yellow\",IF('AOP Side MDB'!D37>=1.33,\"Orange\",IF('AOP Side MDB'!D37>0,\"Brown\",\"Red\"))))","v":{"$error":"#NAME?"}}]
[null,"Pelvis",null,{"$f":"IF('AOP Side MDB'!D42=4,\"Green\",IF('AOP Side MDB'!D42>=2.67,\"Yellow\",IF('AOP Side MDB'!D42>=1.33,\"Orange\",IF('AOP Side MDB'!D42>0,\"Brown\",\"Red\"))))","v":{"$error":"#NAME?"}}]
[null,"Rounded Total",{"$f":"ROUND('AOP Side MDB'!D53,1)","v":{"$error":"#NAME?"}}]
[null,"Max Points",6]
[]
[null,"Side Pole"]
[null,"Head colour",null,{"$f":"IF('AOP Side Pole'!D11=4,\"Green\",IF('AOP Side Pole'!D11>=2.67,\"Yellow\",IF('AOP Side Pole'!D11>=1.33,\"Orange\",IF('AOP Side Pole'!D11>0,\"Brown\",\"Red\"))))","v":"Red"}]
[null,"Chest colour",null,{"$f":"IF('AOP Side Pole'!D26=4,\"Green\",IF('AOP Side Pole'!D26>=2.67,\"Yellow\",IF('AOP Side Pole'!D26>=1.33,\"Orange\",IF('AOP Side Pole'!D26>0,\"Brown\",\"Red\"))))","v":{"$error":"#NAME?"}}]
[null,"Abdomen",null,{"$f":"IF('AOP Side Pole'!D37=4,\"Green\",IF('AOP Side Pole'!D37>=2.67,\"Yellow\",IF('AOP Side Pole'!D37>=1.33,\"Orange\",IF('AOP Side Pole'!D37>0,\"Brown\",\"Red\"))))","v":{"$error":"#NAME?"}}]
[null,"Pelvis",null,{"$f":"IF('AOP Side Pole'!D42=4,\"Green\",IF('AOP Side Pole'!D42>=2.67,\"Yellow\",IF('AOP Side Pole'!D42>=1.33,\"Orange\",IF('AOP Side Pole'!D42>0,\"Brown\",\"Red\"))))","v":{"$error":"#NAME?"}}]
[null,"Rounded Total",{"$f":"ROUND('AOP Side Pole'!D72,1)","v":{"$error":"#NAME?"}}]
[null,"Max Points",6]
[]
[null,"Far Side",null,"MDB",null,"Pole"]
[null,"Excursion Zone",{"$f":"IF(D67<F67,IF(AND('AOP Farside'!D10=\"Red\",'AOP Farside'!D11=\"Yes\"),\"Brown\",'AOP Farside'!D10),IF(AND('AOP Farside'!F10=\"Red\",'AOP Farside'!F11=\"Yes\"),\"Brown\",'AOP Farside'!F10))","v":{"$error":"#NAME?"}}]
[null,"Head colour",{"$f":"IF($D$67<$F$67,D63,F63)","v":{"$error":"#NAME?"}},{"$f":"IF(OR('AOP Farside'!D16>700,'AOP Farside'!D17>80,'AOP Farside'!D10=\"Capping\"),\"Red\",\"Grey\")","v":"Grey"},null,{"$f":"IF(OR('AOP Farside'!F16>700,'AOP Farside'!F17>80,'AOP Farside'!F10=\"Capping\"),\"Red\",\"Grey\")","v":"Grey"}]
[null,"Neck colour",{"$f":"IF($D$67<$F$67,D64,F64)","v":{"$error":"#NAME?"}},{"$f":"\"Grey\"","v":"Grey"},null,{"$f":"\"Grey\"","v":"Grey"}]
[null,"Chest & Abdomen",{"$f":"IF($D$67<$F$67,D65,F65)","v":{"$error":"#NAME?"}},{"$f":"IF(OR(MAX('AOP Farside'!D34:D36)>50,MAX('AOP Farside'!D39:D40)>65),\"Red\",\"Grey\")","v":"Grey"},null,{"$f":"IF(OR(MAX('AOP Farside'!F34:F36)>50,MAX('AOP Farside'!F39:F40)>65),\"Red\",\"Grey\")","v":"Grey"}]
[null,"Pelvis",{"$f":"IF($D$67<$F$67,D66,F66)","v":{"$error":"#NAME?"}},{"$f":"IF('AOP Farside'!D50=-4,\"Red\",\"Grey\")","v":"Grey"},null,{"$f":"IF('AOP Farside'!F50=-4,\"Red\",\"Grey\")","v":"Grey"}]
[null,"Rounded Test Score",null,{"$f":"ROUND('AOP Farside'!D59,1)","v":{"$error":"#NAME?"}},null,{"$f":"ROUND('AOP Farside'!F59,1)","v":{"$error":"#NAME?"}}]
[null,"Rounded Total",{"$f":"ROUND('AOP Farside'!D69,1)","v":{"$error":"#NAME?"}}]
[null,"Max Points",4]
[null,"O2O head colour",null,{"$f":"IF(AND('AOP Farside'!F62=\"\",'AOP Farside'!D62=\"\"),\"Grey\",IF('AOP Farside'!D67=0,\"Green\",IF('AOP Farside'!D67<0,\"Red\",\"VALUE!\")))","v":"Grey"}]
[null,"WHIPLASH"]
[null,"rounded total",{"$f":"ROUND('AOP Whiplash'!D74,1)","v":{"$error":"#NAME?"}}]
[null,"max points",4]
[null,"rounded static assessment",{"$f":"ROUND('AOP Whiplash'!D23,1)","v":{"$error":"#NAME?"}}]
[null,"dynamic rounded mid",{"$f":"ROUND('AOP Whiplash'!D40,1)","v":{"$error":"#NAME?"}}]
[null,"dynamic rounded high",{"$f":"ROUND('AOP Whiplash'!F40,1)","v":{"$error":"#NAME?"}}]
[null,null,null,"points"]
[null,"front_whiplash_colour",{"$f":"IF(D78>=2.25,\"Green\",IF(D78>1.125,\"Orange\",\"Red\"))","v":{"$error":"#NAME?"}},{"$f":"'AOP Whiplash'!D71","v":{"$error":"#NAME?"}}]
[null,"rear_whiplash_colour",{"$f":"IF(D79>=0.667,\"Green\",IF(D79>0.333,\"Orange\",\"Red\"))","v":"Red"},{"$f":"'AOP Whiplash'!D72","v":0}]
[]
[null,"RESCUE"]
[null,"rescue sheet comment",{"$f":"CONCATENATE(D82,E82)","v":"Not available in some countries, not ISO compliant"},{"$f":"IF(AND('AOP Rescue'!D7:D10=\"PASS\"),\"Available\",\"Not available in some countries\")","v":"Not available in some countries"},{"$f":"IF(AND('AOP Rescue'!H7:H10=\"PASS\"),\", ISO compliant\",\", not ISO compliant\")","v":", not ISO compliant"}]
[null,"advanced eCall comment",{"$f":"IF(OR('General Overview'!E35=\"Standard\",'General Overview'!E35=\"Optional meeting fitment\"),\"Available\",\"Not available\")","v":"Not available"}]
[null,"MCB comment",{"$f":"IF(OR('General Overview'!E36=\"Standard\",'General Overview'!E36=\"Optional meeting fitment\"),\"Available\",\"Not available\")","v":"Not available"}]
[null,"Rescue rounded",{"$f":"ROUND('AOP Rescue'!D50,1)","v":0},{"$f":"IF(AND('AOP Rescue'!D7:D10=\"PASS\",'AOP Rescue'!H7:H10=\"PASS\"),\"GREEN\",IF(AND('AOP Rescue'!D7:D10=\"PASS\"),\"ORANGE\",\"RED\"))","v":"RED"}]
[null,"Extrication rounded",{"$f":"ROUND('AOP Rescue'!D51,1)","v":0}]
[null,"Post_Crash rounded",{"$f":"ROUND('AOP Rescue'!D52,1)","v":0},{"$f":"IF('AOP Rescue'!D47=2,\"GREEN\",IF('AOP Rescue'!D47>0,\"ORANGE\",\"RED\"))","v":"RED"}]
[null,"Rounded Total",{"$f":"ROUND('AOP Rescue'!D54,1)","v":0}]
[null,"Max Points",2]
["---->>","rescue_sheet_url_en"]
["---->>","rescue_sheet_url_de"]
["---->>","rescue_sheet_url_fr"]
["---->>","rescue_sheet_url_es"]
[]
[]
[null,"COP Dynamic",null,"Q6",null,"Q10"]
[null,"CRS Type",null,{"$f":"IF('COP Dynamic'!D9=\"Highback booster\",\"b\",\"a\")","v":"b"},null,"b"]
[null,"Frontal",{"$f":"'COP Dynamic'!D52+'COP Dynamic'!F52","v":{"$error":"#NAME?"}},{"$f":"ROUND(C98,1)","v":{"$error":"#NAME?"}}]
[null,"Head",null,{"$f":"IF('COP Dynamic'!E22=4,\"Green\",IF('COP Dynamic'!E22>=2.667,\"Yellow\",IF('COP Dynamic'!E22>=1.333,\"Orange\",IF('COP Dynamic'!E22>0,\"Brown\",\"Red\"))))","v":{"$error":"#NAME?"}},null,{"$f":"IF('COP Dynamic'!G22=4,\"Green\",IF('COP Dynamic'!G22>=2.667,\"Yellow\",IF('COP Dynamic'!G22>=1.333,\"Orange\",IF('COP Dynamic'!G22>0,\"Brown\",\"Red\"))))","v":{"$error":"#NAME?"}}]
[null,"Neck",null,{"$f":"IF('COP Dynamic'!E28=2,\"Green\",IF('COP Dynamic'!E28>=1.335,\"Yellow\",IF('COP Dynamic'!E28>=0.667,\"Orange\",IF('COP Dynamic'!E28>0,\"Brown\",\"Red\"))))","v":{"$error":"#NAME?"}},null,{"$f":"IF('COP Dynamic'!G28=2,\"Green\",IF('COP Dynamic'!G28>=1.335,\"Yellow\",IF('COP Dynamic'!G28>=0.667,\"Orange\",IF('COP Dynamic'!G28>0,\"Brown\",\"Red\"))))","v":{"$error":"#NAME?"}}]
[null,"Chest",null,{"$f":"IF('COP Dynamic'!E33=2,\"Green\",IF('COP Dynamic'!E33>=1.335,\"Yellow\",IF('COP Dynamic'!E33>=0.667,\"Orange\",IF('COP Dynamic'!E33>0,\"Brown\",\"Red\"))))","v":{"$error":"#NAME?"}},null,{"$f":"IF('COP Dynamic'!G33=2,\"Green\",IF('COP Dynamic'!G33>=1.335,\"Yellow\",IF('COP Dynamic'!G33>=0.667,\"Orange\",IF('COP Dynamic'!G33>0,\"Brown\",\"Red\"))))","v":{"$error":"#NAME?"}}]
[null,"Side",{"$f":"'COP Dynamic'!D53+'COP Dynamic'!F53","v":{"$error":"#NAME?"}},{"$f":"ROUND(C102,1)","v":{"$error":"#NAME?"}}]
[null,"Head",null,{"$f":"IF('COP Dynamic'!E43=2,\"Green\",IF('COP Dynamic'!E43>=1.335,\"Yellow\",IF('COP Dynamic'!E43>=0.667,\"Orange\",IF('COP Dynamic'!E43>0,\"Brown\",\"Red\"))))","v":{"$error":"#NAME?"}},null,{"$f":"IF('COP Dynamic'!G43=2,\"Green\",IF('COP Dynamic'!G43>=1.335,\"Yellow\",IF('COP Dynamic'!G43>=0.667,\"Orange\",IF('COP Dynamic'!G43>0,\"Brown\",\"Red\"))))","v":{"$error":"#NAME?"}}]
[null,"Neck",null,{"$f":"IF('COP Dynamic'!E46=1,\"Green\",IF('COP Dynamic'!E46>=0.667,\"Yellow\",IF('COP Dynamic'!E46>=0.333,\"Orange\",IF('COP Dynamic'!E46>0,\"Brown\",\"Red\"))))","v":"Red"},null,{"$f":"IF('COP Dynamic'!G46=1,\"Green\",IF('COP Dynamic'!G46>=0.667,\"Yellow\",IF('COP Dynamic'!G46>=0.333,\"Orange\",IF('COP Dynamic'!G46>0,\"Brown\",\"Red\"))))","v":"Red"}]
[null,"Chest",null,{"$f":"IF('COP Dynamic'!E48=1,\"Green\",IF('COP Dynamic'!E48>=0.667,\"Yellow\",IF('COP Dynamic'!E48>=0.333,\"Orange\",IF('COP Dynamic'!E48>0,\"Brown\",\"Red\"))))","v":"Red"},null,{"$f":"IF('COP Dynamic'!G48=1,\"Green\",IF('COP Dynamic'!G48>=0.667,\"Yellow\",IF('COP Dynamic'!G48>=0.333,\"Orange\",IF('COP Dynamic'!G48>0,\"Brown\",\"Red\"))))","v":"Red"}]
[null,"rounded total",{"$f":"ROUND('COP Dynamic'!D57,1)","v":{"$error":"#NAME?"}}]
[null,"Max Dynamic Points",24]
[null,"COP Vehicle-Based"]
[null,"Website Table",null,"Front Passenger","2nd row Outboard","2nd row Centre","3rd row Outboard","3rd row Centre"]
[]
["---->>",null,"ISOFIX",null,null,null,null,null,"MAP FROM EM"]
["---->>",null,"iSize"]
["---->>",null,"Integrated CRS"]
[null,"rounded total",{"$f":"ROUND('COP Vehicle Based'!D37,1)","v":0}]
[null,"MAX POINTS",13]
[null,"COP CRS Installation"]
[null,"Seat Arrangement",{"$f":"CONCATENATE('General Overview'!C16,'General Overview'!C17,'General Overview'!C18)","v":""}]
[null,null,"Maxi Cosi 2way Pearl & 2wayFix",null,"_ I L _","i-Size"]
[null,"Maxi Cosi Cabriofix (Group 0+)","Belt","Up to 18 months"]
[null,"Maxi Cosi Cabriofix & EasyBase2 (Group I)","Belt","Up to 18 months"]
[null,"Britax Römer King II LS (Group I)","Belt","1 to 4 years"]
[null,"Britax Römer KidFix XP (Group II/III)","Belt","from 4 years"]
[null,"BeSafe iZi Combi X4 ISOfix (Group 0+/I)","ISOFIX","Up to 4 years"]
[null,"Britax Römer KidFix XP (Group II/III)","ISOFIX","1 to 4 years",null,null,"CHEck what is used"]
[null,"Maxi Cosi 2way Pearl & 2wayFix - rearward (67-105cm)","i-Size","from 4 years"]
[null,"Maxi Cosi 2way Pearl & 2wayFix - forward (>15m-105cm)","i-Size","Up to 4 years"]
[null,"BeSafe iZi Kid X2 i-Size (61-105cm)","i-Size","18 months to 4 years"]
[null,"Britax Römer TriFix2 i-Size (76-105cm)","i-Size","Up to 4 years"]
[null,"BeSafe iZi Flex FIX i-Size (100-135cm)","i-Size","4 to 12 years"]
[null,"OEM 1","OEM 1"]
[null,"OEM 2","OEM 2"]
[null,"OEM 3","OEM 3"]
[null,"OEM 4","OEM 4"]
[null,"Universal_rounded",{"$f":"ROUND('COP CRS Installation'!H23,1)","v":0}]
[null,"ISOFIX_rounded",{"$f":"ROUND('COP CRS Installation'!H24,1)","v":0}]
[null,"i-Size_rounded",{"$f":"ROUND('COP CRS Installation'!H25,1)","v":0}]
[null,"OEM_rounded",{"$f":"ROUND('COP CRS Installation'!H26,1)","v":0}]
[null,"ROUNDED TOTAL",{"$f":"ROUND('COP CRS Installation'!H28,1)","v":0}]
[null,"MAX POINTS",12]
[]
[null,"VRU"]
[null,"VRU Headform"]
["---->>","Start row",12,{"$f":"C143","v":12}]
[null,"Type of car image",{"$f":"'General Overview'!C19","v":0},{"$f":"IF(OR(C144=\"Supermini\",C144=\"Small Family Car\",C144=\"Large Family Car\",C144=\"Executive\",C144=\"Roadster sports\"),\"Normal car\",IF(OR(C144=\"Small Off-Road 4x4\",C144=\"Large Off-Road 4x4\",C144=\"Pick-up\"),\"Off road\",IF(OR(C144=\"Small MPV\",C144=\"Large MPV\"),\"MPV\",IF(C144=\"Business and Family Vans\",\"Van\",\"\"))))","v":""}]
[null,null,14,{"$f":"IF(NOT('VRU Headform'!E5=\"Blue\"),IF(OR('VRU Headform'!E5=\"Red\",'VRU Headform'!E5=\"D Red\"),\"Red\",IF(OR('VRU Headform'!E5=\"Green\",'VRU Headform'!E5=\"D Green\"),\"Green\",'VRU Headform'!E5)))","v":0},{"$f":"IF(NOT('VRU Headform'!F5=\"Blue\"),IF(OR('VRU Headform'!F5=\"Red\",'VRU Headform'!F5=\"D Red\"),\"Red\",IF(OR('VRU Headform'!F5=\"Green\",'VRU Headform'!F5=\"D Green\"),\"Green\",'VRU Headform'!F5)))","v":0},{"$f":"IF(NOT('VRU Headform'!G5=\"Blue\"),IF(OR('VRU Headform'!G5=\"Red\",'VRU Headform'!G5=\"D Red\"),\"Red\",IF(OR('VRU Headform'!G5=\"Green\",'VRU Headform'!G5=\"D Green\"),\"Green\",'VRU Headform'!G5)))","v":0},{"$f":"IF(NOT('VRU Headform'!H5=\"Blue\"),IF(OR('VRU Headform'!H5=\"Red\",'VRU Headform'!H5=\"D Red\"),\"Red\",IF(OR('VRU Headform'!H5=\"Green\",'VRU Headform'!H5=\"D Green\"),\"Green\",'VRU Headform'!H5)))","v":0},{"$f":"IF(NOT('VRU Headform'!I5=\"Blue\"),IF(OR('VRU Headform'!I5=\"Red\",'VRU Headform'!I5=\"D Red\"),\"Red\",IF(OR('VRU Headform'!I5=\"Green\",'VRU Headform'!I5=\"D Green\"),\"Green\",'VRU Headform'!I5)))","v":0},{"$f":"IF(NOT('VRU Headform'!J5=\"Blue\"),IF(OR('VRU Headform'!J5=\"Red\",'VRU Headform'!J5=\"D Red\"),\"Red\",IF(OR('VRU Headform'!J5=\"Green\",'VRU Headform'!J5=\"D Green\"),\"Green\",'VRU Headform'!J5)))","v":0},{"$f":"IF(NOT('VRU Headform'!K5=\"Blue\"),IF(OR('VRU Headform'!K5=\"Red\",'VRU Headform'!K5=\"D Red\"),\"Red\",IF(OR('VRU Headform'!K5=\"Green\",'VRU Headform'!K5=\"D Green\"),\"Green\",'VRU Headform'!K5)))","v":0},{"$f":"IF(NOT('VRU Headform'!L5=\"Blue\"),IF(OR('VRU Headform'!L5=\"Red\",'VRU Headform'!L5=\"D Red\"),\"Red\",IF(OR('VRU Headform'!L5=\"Green\",'VRU Headform'!L5=\"D Green\"),\"Green\",'VRU Headform'!L5)))","v":0},{"$f":"IF(NOT('VRU Headform'!M5=\"Blue\"),IF(OR('VRU Headform'!M5=\"Red\",'VRU Headform'!M5=\"D Red\"),\"Red\",IF(OR('VRU Headform'!M5=\"Green\",'VRU Headform'!M5=\"D Green\"),\"Green\",'VRU Headform'!M5)))","v":0},{"$f":"IF(NOT('VRU Headform'!N5=\"Blue\"),IF(OR('VRU Headform'!N5=\"Red\",'VRU Headform'!N5=\"D Red\"),\"Red\",IF(OR('VRU Headform'!N5=\"Green\",'VRU Headform'!N5=\"D Green\"),\"Green\",'VRU Headform'!N5)))","v":0},{"$f":"IF(NOT('VRU Headform'!O5=\"Blue\"),IF(OR('VRU Headform'!O5=\"Red\",'VRU Headform'!O5=\"D Red\"),\"Red\",IF(OR('VRU Headform'!O5=\"Green\",'VRU Headform'!O5=\"D Green\"),\"Green\",'VRU Headform'!O5)))","v":0},{"$f":"IF(NOT('VRU Headform'!P5=\"Blue\"),IF(OR('VRU Headform'!P5=\"Red\",'VRU Headform'!P5=\"D Red\"),\"Red\",IF(OR('VRU Headform'!P5=\"Green\",'VRU Headform'!P5=\"D Green\"),\"Green\",'VRU Headform'!P5)))","v":0},{"$f":"IF(NOT('VRU Headform'!Q5=\"Blue\"),IF(OR('VRU Headform'!Q5=\"Red\",'VRU Headform'!Q5=\"D Red\"),\"Red\",IF(OR('VRU Headform'!Q5=\"Green\",'VRU Headform'!Q5=\"D Green\"),\"Green\",'VRU Headform'!Q5)))","v":0},{"$f":"IF(NOT('VRU Headform'!R5=\"Blue\"),IF(OR('VRU Headform'!R5=\"Red\",'VRU Headform'!R5=\"D Red\"),\"Red\",IF(OR('VRU Headform'!R5=\"Green\",'VRU Headform'!R5=\"D Green\"),\"Green\",'VRU Headform'!R5)))","v":0},{"$f":"IF(NOT('VRU Headform'!S5=\"Blue\"),IF(OR('VRU Headform'!S5=\"Red\",'VRU Headform'!S5=\"D Red\"),\"Red\",IF(OR('VRU Headform'!S5=\"Green\",'VRU Headform'!S5=\"D Green\"),\"Green\",'VRU Headform'!S5)))","v":0},{"$f":"IF(NOT('VRU Headform'!T5=\"Blue\"),IF(OR('VRU Headform'!T5=\"Red\",'VRU Headform'!T5=\"D Red\"),\"Red\",IF(OR('VRU Headform'!T5=\"Green\",'VRU Headform'!T5=\"D Green\"),\"Green\",'VRU Headform'!T5)))","v":0},{"$f":"IF(NOT('VRU Headform'!U5=\"Blue\"),IF(OR('VRU Headform'!U5=\"Red\",'VRU Headform'!U5=\"D Red\"),\"Red\",IF(OR('VRU Headform'!U5=\"Green\",'VRU Headform'!U5=\"D Green\"),\"Green\",'VRU Headform'!U5)))","v":0},{"$f":"IF(NOT('VRU Headform'!V5=\"Blue\"),IF(OR('VRU Headform'!V5=\"Red\",'VRU Headform'!V5=\"D Red\"),\"Red\",IF(OR('VRU Headform'!V5=\"Green\",'VRU Headform'!V5=\"D Green\"),\"Green\",'VRU Headform'!V5)))","v":0},{"$f":"IF(NOT('VRU Headform'!W5=\"Blue\"),IF(OR('VRU Headform'!W5=\"Red\",'VRU Headform'!W5=\"D Red\"),\"Red\",IF(OR('VRU Headform'!W5=\"Green\",'VRU Headform'!W5=\"D Green\"),\"Green\",'VRU Headform'!W5)))","v":0},{"$f":"IF(NOT('VRU Headform'!X5=\"Blue\"),IF(OR('VRU Headform'!X5=\"Red\",'VRU Headform'!X5=\"D Red\"),\"Red\",IF(OR('VRU Headform'!X5=\"Green\",'VRU Headform'!X5=\"D Green\"),\"Green\",'VRU Headform'!X5)))","v":0},{"$f":"IF(NOT('VRU Headform'!Y5=\"Blue\"),IF(OR('VRU Headform'!Y5=\"Red\",'VRU Headform'!Y5=\"D Red\"),\"Red\",IF(OR('VRU Headform'!Y5=\"Green\",'VRU Headform'!Y5=\"D Green\"),\"Green\",'VRU Headform'!Y5)))","v":0},{"$f":"IF(C145=$C$143,\"Yes\",\"No\")","v":"No"}]
[null,null,13,{"$f":"IF(NOT('VRU Headform'!E6=\"Blue\"),IF(OR('VRU Headform'!E6=\"Red\",'VRU Headform'!E6=\"D Red\"),\"Red\",IF(OR('VRU Headform'!E6=\"Green\",'VRU Headform'!E6=\"D Green\"),\"Green\",'VRU Headform'!E6)))","v":0},{"$f":"IF(NOT('VRU Headform'!F6=\"Blue\"),IF(OR('VRU Headform'!F6=\"Red\",'VRU Headform'!F6=\"D Red\"),\"Red\",IF(OR('VRU Headform'!F6=\"Green\",'VRU Headform'!F6=\"D Green\"),\"Green\",'VRU Headform'!F6)))","v":0},{"$f":"IF(NOT('VRU Headform'!G6=\"Blue\"),IF(OR('VRU Headform'!G6=\"Red\",'VRU Headform'!G6=\"D Red\"),\"Red\",IF(OR('VRU Headform'!G6=\"Green\",'VRU Headform'!G6=\"D Green\"),\"Green\",'VRU Headform'!G6)))","v":0},{"$f":"IF(NOT('VRU Headform'!H6=\"Blue\"),IF(OR('VRU Headform'!H6=\"Red\",'VRU Headform'!H6=\"D Red\"),\"Red\",IF(OR('VRU Headform'!H6=\"Green\",'VRU Headform'!H6=\"D Green\"),\"Green\",'VRU Headform'!H6)))","v":0},{"$f":"IF(NOT('VRU Headform'!I6=\"Blue\"),IF(OR('VRU Headform'!I6=\"Red\",'VRU Headform'!I6=\"D Red\"),\"Red\",IF(OR('VRU Headform'!I6=\"Green\",'VRU Headform'!I6=\"D Green\"),\"Green\",'VRU Headform'!I6)))","v":0},{"$f":"IF(NOT('VRU Headform'!J6=\"Blue\"),IF(OR('VRU Headform'!J6=\"Red\",'VRU Headform'!J6=\"D Red\"),\"Red\",IF(OR('VRU Headform'!J6=\"Green\",'VRU Headform'!J6=\"D Green\"),\"Green\",'VRU Headform'!J6)))","v":0},{"$f":"IF(NOT('VRU Headform'!K6=\"Blue\"),IF(OR('VRU Headform'!K6=\"Red\",'VRU Headform'!K6=\"D Red\"),\"Red\",IF(OR('VRU Headform'!K6=\"Green\",'VRU Headform'!K6=\"D Green\"),\"Green\",'VRU Headform'!K6)))","v":0},{"$f":"IF(NOT('VRU Headform'!L6=\"Blue\"),IF(OR('VRU Headform'!L6=\"Red\",'VRU Headform'!L6=\"D Red\"),\"Red\",IF(OR('VRU Headform'!L6=\"Green\",'VRU Headform'!L6=\"D Green\"),\"Green\",'VRU Headform'!L6)))","v":0},{"$f":"IF(NOT('VRU Headform'!M6=\"Blue\"),IF(OR('VRU Headform'!M6=\"Red\",'VRU Headform'!M6=\"D Red\"),\"Red\",IF(OR('VRU Headform'!M6=\"Green\",'VRU Headform'!M6=\"D Green\"),\"Green\",'VRU Headform'!M6)))","v":0},{"$f":"IF(NOT('VRU Headform'!N6=\"Blue\"),IF(OR('VRU Headform'!N6=\"Red\",'VRU Headform'!N6=\"D Red\"),\"Red\",IF(OR('VRU Headform'!N6=\"Green\",'VRU Headform'!N6=\"D Green\"),\"Green\",'VRU Headform'!N6)))","v":0},{"$f":"IF(NOT('VRU Headform'!O6=\"Blue\"),IF(OR('VRU Headform'!O6=\"Red\",'VRU Headform'!O6=\"D Red\"),\"Red\",IF(OR('VRU Headform'!O6=\"Green\",'VRU Headform'!O6=\"D Green\"),\"Green\",'VRU Headform'!O6)))","v":0},{"$f":"IF(NOT('VRU Headform'!P6=\"Blue\"),IF(OR('VRU Headform'!P6=\"Red\",'VRU Headform'!P6=\"D Red\"),\"Red\",IF(OR('VRU Headform'!P6=\"Green\",'VRU Headform'!P6=\"D Green\"),\"Green\",'VRU Headform'!P6)))","v":0},{"$f":"IF(NOT('VRU Headform'!Q6=\"Blue\"),IF(OR('VRU Headform'!Q6=\"Red\",'VRU Headform'!Q6=\"D Red\"),\"Red\",IF(OR('VRU Headform'!Q6=\"Green\",'VRU Headform'!Q6=\"D Green\"),\"Green\",'VRU Headform'!Q6)))","v":0},{"$f":"IF(NOT('VRU Headform'!R6=\"Blue\"),IF(OR('VRU Headform'!R6=\"Red\",'VRU Headform'!R6=\"D Red\"),\"Red\",IF(OR('VRU Headform'!R6=\"Green\",'VRU Headform'!R6=\"D Green\"),\"Green\",'VRU Headform'!R6)))","v":0},{"$f":"IF(NOT('VRU Headform'!S6=\"Blue\"),IF(OR('VRU Headform'!S6=\"Red\",'VRU Headform'!S6=\"D Red\"),\"Red\",IF(OR('VRU Headform'!S6=\"Green\",'VRU Headform'!S6=\"D Green\"),\"Green\",'VRU Headform'!S6)))","v":0},{"$f":"IF(NOT('VRU Headform'!T6=\"Blue\"),IF(OR('VRU Headform'!T6=\"Red\",'VRU Headform'!T6=\"D Red\"),\"Red\",IF(OR('VRU Headform'!T6=\"Green\",'VRU Headform'!T6=\"D Green\"),\"Green\",'VRU Headform'!T6)))","v":0},{"$f":"IF(NOT('VRU Headform'!U6=\"Blue\"),IF(OR('VRU Headform'!U6=\"Red\",'VRU Headform'!U6=\"D Red\"),\"Red\",IF(OR('VRU Headform'!U6=\"Green\",'VRU Headform'!U6=\"D Green\"),\"Green\",'VRU Headform'!U6)))","v":0},{"$f":"IF(NOT('VRU Headform'!V6=\"Blue\"),IF(OR('VRU Headform'!V6=\"Red\",'VRU Headform'!V6=\"D Red\"),\"Red\",IF(OR('VRU Headform'!V6=\"Green\",'VRU Headform'!V6=\"D Green\"),\"Green\",'VRU Headform'!V6)))","v":0},{"$f":"IF(NOT('VRU Headform'!W6=\"Blue\"),IF(OR('VRU Headform'!W6=\"Red\",'VRU Headform'!W6=\"D Red\"),\"Red\",IF(OR('VRU Headform'!W6=\"Green\",'VRU Headform'!W6=\"D Green\"),\"Green\",'VRU Headform'!W6)))","v":0},{"$f":"IF(NOT('VRU Headform'!X6=\"Blue\"),IF(OR('VRU Headform'!X6=\"Red\",'VRU Headform'!X6=\"D Red\"),\"Red\",IF(OR('VRU Headform'!X6=\"Green\",'VRU Headform'!X6=\"D Green\"),\"Green\",'VRU Headform'!X6)))","v":0},{"$f":"IF(NOT('VRU Headform'!Y6=\"Blue\"),IF(OR('VRU Headform'!Y6=\"Red\",'VRU Headform'!Y6=\"D Red\"),\"Red\",IF(OR('VRU Headform'!Y6=\"Green\",'VRU Headform'!Y6=\"D Green\"),\"Green\",'VRU Headform'!Y6)))","v":0},"No"]
[null,{"$f":"IF(OR(D136:X150=0),\"COLOUR MISSING\",\"ALL OK\")","v":"COLOUR MISSING"},12,{"$f":"IF(NOT('VRU Headform'!E7=\"Blue\"),IF(OR('VRU Headform'!E7=\"Red\",'VRU Headform'!E7=\"D Red\"),\"Red\",IF(OR('VRU Headform'!E7=\"Green\",'VRU Headform'!E7=\"D Green\"),\"Green\",'VRU Headform'!E7)))","v":0},{"$f":"IF(NOT('VRU Headform'!F7=\"Blue\"),IF(OR('VRU Headform'!F7=\"Red\",'VRU Headform'!F7=\"D Red\"),\"Red\",IF(OR('VRU Headform'!F7=\"Green\",'VRU Headform'!F7=\"D Green\"),\"Green\",'VRU Headform'!F7)))","v":0},{"$f":"IF(NOT('VRU Headform'!G7=\"Blue\"),IF(OR('VRU Headform'!G7=\"Red\",'VRU Headform'!G7=\"D Red\"),\"Red\",IF(OR('VRU Headform'!G7=\"Green\",'VRU Headform'!G7=\"D Green\"),\"Green\",'VRU Headform'!G7)))","v":0},{"$f":"IF(NOT('VRU Headform'!H7=\"Blue\"),IF(OR('VRU Headform'!H7=\"Red\",'VRU Headform'!H7=\"D Red\"),\"Red\",IF(OR('VRU Headform'!H7=\"Green\",'VRU Headform'!H7=\"D Green\"),\"Green\",'VRU Headform'!H7)))","v":0},{"$f":"IF(NOT('VRU Headform'!I7=\"Blue\"),IF(OR('VRU Headform'!I7=\"Red\",'VRU Headform'!I7=\"D Red\"),\"Red\",IF(OR('VRU Headform'!I7=\"Green\",'VRU Headform'!I7=\"D Green\"),\"Green\",'VRU Headform'!I7)))","v":0},{"$f":"IF(NOT('VRU Headform'!J7=\"Blue\"),IF(OR('VRU Headform'!J7=\"Red\",'VRU Headform'!J7=\"D Red\"),\"Red\",IF(OR('VRU Headform'!J7=\"Green\",'VRU Headform'!J7=\"D Green\"),\"Green\",'VRU Headform'!J7)))","v":0},{"$f":"IF(NOT('VRU Headform'!K7=\"Blue\"),IF(OR('VRU Headform'!K7=\"Red\",'VRU Headform'!K7=\"D Red\"),\"Red\",IF(OR('VRU Headform'!K7=\"Green\",'VRU Headform'!K7=\"D Green\"),\"Green\",'VRU Headform'!K7)))","v":0},{"$f":"IF(NOT('VRU Headform'!L7=\"Blue\"),IF(OR('VRU Headform'!L7=\"Red\",'VRU Headform'!L7=\"D Red\"),\"Red\",IF(OR('VRU Headform'!L7=\"Green\",'VRU Headform'!L7=\"D Green\"),\"Green\",'VRU Headform'!L7)))","v":0},{"$f":"IF(NOT('VRU Headform'!M7=\"Blue\"),IF(OR('VRU Headform'!M7=\"Red\",'VRU Headform'!M7=\"D Red\"),\"Red\",IF(OR('VRU Headform'!M7=\"Green\",'VRU Headform'!M7=\"D Green\"),\"Green\",'VRU Headform'!M7)))","v":0},{"$f":"IF(NOT('VRU Headform'!N7=\"Blue\"),IF(OR('VRU Headform'!N7=\"Red\",'VRU Headform'!N7=\"D Red\"),\"Red\",IF(OR('VRU Headform'!N7=\"Green\",'VRU Headform'!N7=\"D Green\"),\"Green\",'VRU Headform'!N7)))","v":0},{"$f":"IF(NOT('VRU Headform'!O7=\"Blue\"),IF(OR('VRU Headform'!O7=\"Red\",'VRU Headform'!O7=\"D Red\"),\"Red\",IF(OR('VRU Headform'!O7=\"Green\",'VRU Headform'!O7=\"D Green\"),\"Green\",'VRU Headform'!O7)))","v":0},{"$f":"IF(NOT('VRU Headform'!P7=\"Blue\"),IF(OR('VRU Headform'!P7=\"Red\",'VRU Headform'!P7=\"D Red\"),\"Red\",IF(OR('VRU Headform'!P7=\"Green\",'VRU Headform'!P7=\"D Green\"),\"Green\",'VRU Headform'!P7)))","v":0},{"$f":"IF(NOT('VRU Headform'!Q7=\"Blue\"),IF(OR('VRU Headform'!Q7=\"Red\",'VRU Headform'!Q7=\"D Red\"),\"Red\",IF(OR('VRU Headform'!Q7=\"Green\",'VRU Headform'!Q7=\"D Green\"),\"Green\",'VRU Headform'!Q7)))","v":0},{"$f":"IF(NOT('VRU Headform'!R7=\"Blue\"),IF(OR('VRU Headform'!R7=\"Red\",'VRU Headform'!R7=\"D Red\"),\"Red\",IF(OR('VRU Headform'!R7=\"Green\",'VRU Headform'!R7=\"D Green\"),\"Green\",'VRU Headform'!R7)))","v":0},{"$f":"IF(NOT('VRU Headform'!S7=\"Blue\"),IF(OR('VRU Headform'!S7=\"Red\",'VRU Headform'!S7=\"D Red\"),\"Red\",IF(OR('VRU Headform'!S7=\"Green\",'VRU Headform'!S7=\"D Green\"),\"Green\",'VRU Headform'!S7)))","v":0},{"$f":"IF(NOT('VRU Headform'!T7=\"Blue\"),IF(OR('VRU Headform'!T7=\"Red\",'VRU Headform'!T7=\"D Red\"),\"Red\",IF(OR('VRU Headform'!T7=\"Green\",'VRU Headform'!T7=\"D Green\"),\"Green\",'VRU Headform'!T7)))","v":0},{"$f":"IF(NOT('VRU Headform'!U7=\"Blue\"),IF(OR('VRU Headform'!U7=\"Red\",'VRU Headform'!U7=\"D Red\"),\"Red\",IF(OR('VRU Headform'!U7=\"Green\",'VRU Headform'!U7=\"D Green\"),\"Green\",'VRU Headform'!U7)))","v":0},{"$f":"IF(NOT('VRU Headform'!V7=\"Blue\"),IF(OR('VRU Headform'!V7=\"Red\",'VRU Headform'!V7=\"D Red\"),\"Red\",IF(OR('VRU Headform'!V7=\"Green\",'VRU Headform'!V7=\"D Green\"),\"Green\",'VRU Headform'!V7)))","v":0},{"$f":"IF(NOT('VRU Headform'!W7=\"Blue\"),IF(OR('VRU Headform'!W7=\"Red\",'VRU Headform'!W7=\"D Red\"),\"Red\",IF(OR('VRU Headform'!W7=\"Green\",'VRU Headform'!W7=\"D Green\"),\"Green\",'VRU Headform'!W7)))","v":0},{"$f":"IF(NOT('VRU Headform'!X7=\"Blue\"),IF(OR('VRU Headform'!X7=\"Red\",'VRU Headform'!X7=\"D Red\"),\"Red\",IF(OR('VRU Headform'!X7=\"Green\",'VRU Headform'!X7=\"D Green\"),\"Green\",'VRU Headform'!X7)))","v":0},{"$f":"IF(NOT('VRU Headform'!Y7=\"Blue\"),IF(OR('VRU Headform'!Y7=\"Red\",'VRU Headform'!Y7=\"D Red\"),\"Red\",IF(OR('VRU Headform'!Y7=\"Green\",'VRU Headform'!Y7=\"D Green\"),\"Green\",'VRU Headform'!Y7)))","v":0},"Yes"]
[null,null,11,{"$f":"IF(NOT('VRU Headform'!E8=\"Blue\"),IF(OR('VRU Headform'!E8=\"Red\",'VRU Headform'!E8=\"D Red\"),\"Red\",IF(OR('VRU Headform'!E8=\"Green\",'VRU Headform'!E8=\"D Green\"),\"Green\",'VRU Headform'!E8)))","v":0},{"$f":"IF(NOT('VRU Headform'!F8=\"Blue\"),IF(OR('VRU Headform'!F8=\"Red\",'VRU Headform'!F8=\"D Red\"),\"Red\",IF(OR('VRU Headform'!F8=\"Green\",'VRU Headform'!F8=\"D Green\"),\"Green\",'VRU Headform'!F8)))","v":0},{"$f":"IF(NOT('VRU Headform'!G8=\"Blue\"),IF(OR('VRU Headform'!G8=\"Red\",'VRU Headform'!G8=\"D Red\"),\"Red\",IF(OR('VRU Headform'!G8=\"Green\",'VRU Headform'!G8=\"D Green\"),\"Green\",'VRU Headform'!G8)))","v":0},{"$f":"IF(NOT('VRU Headform'!H8=\"Blue\"),IF(OR('VRU Headform'!H8=\"Red\",'VRU Headform'!H8=\"D Red\"),\"Red\",IF(OR('VRU Headform'!H8=\"Green\",'VRU Headform'!H8=\"D Green\"),\"Green\",'VRU Headform'!H8)))","v":0},{"$f":"IF(NOT('VRU Headform'!I8=\"Blue\"),IF(OR('VRU Headform'!I8=\"Red\",'VRU Headform'!I8=\"D Red\"),\"Red\",IF(OR('VRU Headform'!I8=\"Green\",'VRU Headform'!I8=\"D Green\"),\"Green\",'VRU Headform'!I8)))","v":0},{"$f":"IF(NOT('VRU Headform'!J8=\"Blue\"),IF(OR('VRU Headform'!J8=\"Red\",'VRU Headform'!J8=\"D Red\"),\"Red\",IF(OR('VRU Headform'!J8=\"Green\",'VRU Headform'!J8=\"D Green\"),\"Green\",'VRU Headform'!J8)))","v":0},{"$f":"IF(NOT('VRU Headform'!K8=\"Blue\"),IF(OR('VRU Headform'!K8=\"Red\",'VRU Headform'!K8=\"D Red\"),\"Red\",IF(OR('VRU Headform'!K8=\"Green\",'VRU Headform'!K8=\"D Green\"),\"Green\",'VRU Headform'!K8)))","v":0},{"$f":"IF(NOT('VRU Headform'!L8=\"Blue\"),IF(OR('VRU Headform'!L8=\"Red\",'VRU Headform'!L8=\"D Red\"),\"Red\",IF(OR('VRU Headform'!L8=\"Green\",'VRU Headform'!L8=\"D Green\"),\"Green\",'VRU Headform'!L8)))","v":0},{"$f":"IF(NOT('VRU Headform'!M8=\"Blue\"),IF(OR('VRU Headform'!M8=\"Red\",'VRU Headform'!M8=\"D Red\"),\"Red\",IF(OR('VRU Headform'!M8=\"Green\",'VRU Headform'!M8=\"D Green\"),\"Green\",'VRU Headform'!M8)))","v":0},{"$f":"IF(NOT('VRU Headform'!N8=\"Blue\"),IF(OR('VRU Headform'!N8=\"Red\",'VRU Headform'!N8=\"D Red\"),\"Red\",IF(OR('VRU Headform'!N8=\"Green\",'VRU Headform'!N8=\"D Green\"),\"Green\",'VRU Headform'!N8)))","v":0},{"$f":"IF(NOT('VRU Headform'!O8=\"Blue\"),IF(OR('VRU Headform'!O8=\"Red\",'VRU Headform'!O8=\"D Red\"),\"Red\",IF(OR('VRU Headform'!O8=\"Green\",'VRU Headform'!O8=\"D Green\"),\"Green\",'VRU Headform'!O8)))","v":0},{"$f":"IF(NOT('VRU Headform'!P8=\"Blue\"),IF(OR('VRU Headform'!P8=\"Red\",'VRU Headform'!P8=\"D Red\"),\"Red\",IF(OR('VRU Headform'!P8=\"Green\",'VRU Headform'!P8=\"D Green\"),\"Green\",'VRU Headform'!P8)))","v":0},{"$f":"IF(NOT('VRU Headform'!Q8=\"Blue\"),IF(OR('VRU Headform'!Q8=\"Red\",'VRU Headform'!Q8=\"D Red\"),\"Red\",IF(OR('VRU Headform'!Q8=\"Green\",'VRU Headform'!Q8=\"D Green\"),\"Green\",'VRU Headform'!Q8)))","v":0},{"$f":"IF(NOT('VRU Headform'!R8=\"Blue\"),IF(OR('VRU Headform'!R8=\"Red\",'VRU Headform'!R8=\"D Red\"),\"Red\",IF(OR('VRU Headform'!R8=\"Green\",'VRU Headform'!R8=\"D Green\"),\"Green\",'VRU Headform'!R8)))","v":0},{"$f":"IF(NOT('VRU Headform'!S8=\"Blue\"),IF(OR('VRU Headform'!S8=\"Red\",'VRU Headform'!S8=\"D Red\"),\"Red\",IF(OR('VRU Headform'!S8=\"Green\",'VRU Headform'!S8=\"D Green\"),\"Green\",'VRU Headform'!S8)))","v":0},{"$f":"IF(NOT('VRU Headform'!T8=\"Blue\"),IF(OR('VRU Headform'!T8=\"Red\",'VRU Headform'!T8=\"D Red\"),\"Red\",IF(OR('VRU Headform'!T8=\"Green\",'VRU Headform'!T8=\"D Green\"),\"Green\",'VRU Headform'!T8)))","v":0},{"$f":"IF(NOT('VRU Headform'!U8=\"Blue\"),IF(OR('VRU Headform'!U8=\"Red\",'VRU Headform'!U8=\"D Red\"),\"Red\",IF(OR('VRU Headform'!U8=\"Green\",'VRU Headform'!U8=\"D Green\"),\"Green\",'VRU Headform'!U8)))","v":0},{"$f":"IF(NOT('VRU Headform'!V8=\"Blue\"),IF(OR('VRU Headform'!V8=\"Red\",'VRU Headform'!V8=\"D Red\"),\"Red\",IF(OR('VRU Headform'!V8=\"Green\",'VRU Headform'!V8=\"D Green\"),\"Green\",'VRU Headform'!V8)))","v":0},{"$f":"IF(NOT('VRU Headform'!W8=\"Blue\"),IF(OR('VRU Headform'!W8=\"Red\",'VRU Headform'!W8=\"D Red\"),\"Red\",IF(OR('VRU Headform'!W8=\"Green\",'VRU Headform'!W8=\"D Green\"),\"Green\",'VRU Headform'!W8)))","v":0},{"$f":"IF(NOT('VRU Headform'!X8=\"Blue\"),IF(OR('VRU Headform'!X8=\"Red\",'VRU Headform'!X8=\"D Red\"),\"Red\",IF(OR('VRU Headform'!X8=\"Green\",'VRU Headform'!X8=\"D Green\"),\"Green\",'VRU Headform'!X8)))","v":0},{"$f":"IF(NOT('VRU Headform'!Y8=\"Blue\"),IF(OR('VRU Headform'!Y8=\"Red\",'VRU Headform'!Y8=\"D Red\"),\"Red\",IF(OR('VRU Headform'!Y8=\"Green\",'VRU Headform'!Y8=\"D Green\"),\"Green\",'VRU Headform'!Y8)))","v":0},"No"]
[null,null,10,{"$f":"IF(NOT('VRU Headform'!E9=\"Blue\"),IF(OR('VRU Headform'!E9=\"Red\",'VRU Headform'!E9=\"D Red\"),\"Red\",IF(OR('VRU Headform'!E9=\"Green\",'VRU Headform'!E9=\"D Green\"),\"Green\",'VRU Headform'!E9)))","v":0},{"$f":"IF(NOT('VRU Headform'!F9=\"Blue\"),IF(OR('VRU Headform'!F9=\"Red\",'VRU Headform'!F9=\"D Red\"),\"Red\",IF(OR('VRU Headform'!F9=\"Green\",'VRU Headform'!F9=\"D Green\"),\"Green\",'VRU Headform'!F9)))","v":0},{"$f":"IF(NOT('VRU Headform'!G9=\"Blue\"),IF(OR('VRU Headform'!G9=\"Red\",'VRU Headform'!G9=\"D Red\"),\"Red\",IF(OR('VRU Headform'!G9=\"Green\",'VRU Headform'!G9=\"D Green\"),\"Green\",'VRU Headform'!G9)))","v":0},{"$f":"IF(NOT('VRU Headform'!H9=\"Blue\"),IF(OR('VRU Headform'!H9=\"Red\",'VRU Headform'!H9=\"D Red\"),\"Red\",IF(OR('VRU Headform'!H9=\"Green\",'VRU Headform'!H9=\"D Green\"),\"Green\",'VRU Headform'!H9)))","v":0},{"$f":"IF(NOT('VRU Headform'!I9=\"Blue\"),IF(OR('VRU Headform'!I9=\"Red\",'VRU Headform'!I9=\"D Red\"),\"Red\",IF(OR('VRU Headform'!I9=\"Green\",'VRU Headform'!I9=\"D Green\"),\"Green\",'VRU Headform'!I9)))","v":0},{"$f":"IF(NOT('VRU Headform'!J9=\"Blue\"),IF(OR('VRU Headform'!J9=\"Red\",'VRU Headform'!J9=\"D Red\"),\"Red\",IF(OR('VRU Headform'!J9=\"Green\",'VRU Headform'!J9=\"D Green\"),\"Green\",'VRU Headform'!J9)))","v":0},{"$f":"IF(NOT('VRU Headform'!K9=\"Blue\"),IF(OR('VRU Headform'!K9=\"Red\",'VRU Headform'!K9=\"D Red\"),\"Red\",IF(OR('VRU Headform'!K9=\"Green\",'VRU Headform'!K9=\"D Green\"),\"Green\",'VRU Headform'!K9)))","v":0},{"$f":"IF(NOT('VRU Headform'!L9=\"Blue\"),IF(OR('VRU Headform'!L9=\"Red\",'VRU Headform'!L9=\"D Red\"),\"Red\",IF(OR('VRU Headform'!L9=\"Green\",'VRU Headform'!L9=\"D Green\"),\"Green\",'VRU Headform'!L9)))","v":0},{"$f":"IF(NOT('VRU Headform'!M9=\"Blue\"),IF(OR('VRU Headform'!M9=\"Red\",'VRU Headform'!M9=\"D Red\"),\"Red\",IF(OR('VRU Headform'!M9=\"Green\",'VRU Headform'!M9=\"D Green\"),\"Green\",'VRU Headform'!M9)))","v":0},{"$f":"IF(NOT('VRU Headform'!N9=\"Blue\"),IF(OR('VRU Headform'!N9=\"Red\",'VRU Headform'!N9=\"D Red\"),\"Red\",IF(OR('VRU Headform'!N9=\"Green\",'VRU Headform'!N9=\"D Green\"),\"Green\",'VRU Headform'!N9)))","v":0},{"$f":"IF(NOT('VRU Headform'!O9=\"Blue\"),IF(OR('VRU Headform'!O9=\"Red\",'VRU Headform'!O9=\"D Red\"),\"Red\",IF(OR('VRU Headform'!O9=\"Green\",'VRU Headform'!O9=\"D Green\"),\"Green\",'VRU Headform'!O9)))","v":0},{"$f":"IF(NOT('VRU Headform'!P9=\"Blue\"),IF(OR('VRU Headform'!P9=\"Red\",'VRU Headform'!P9=\"D Red\"),\"Red\",IF(OR('VRU Headform'!P9=\"Green\",'VRU Headform'!P9=\"D Green\"),\"Green\",'VRU Headform'!P9)))","v":0},{"$f":"IF(NOT('VRU Headform'!Q9=\"Blue\"),IF(OR('VRU Headform'!Q9=\"Red\",'VRU Headform'!Q9=\"D Red\"),\"Red\",IF(OR('VRU Headform'!Q9=\"Green\",'VRU Headform'!Q9=\"D Green\"),\"Green\",'VRU Headform'!Q9)))","v":0},{"$f":"IF(NOT('VRU Headform'!R9=\"Blue\"),IF(OR('VRU Headform'!R9=\"Red\",'VRU Headform'!R9=\"D Red\"),\"Red\",IF(OR('VRU Headform'!R9=\"Green\",'VRU Headform'!R9=\"D Green\"),\"Green\",'VRU Headform'!R9)))","v":0},{"$f":"IF(NOT('VRU Headform'!S9=\"Blue\"),IF(OR('VRU Headform'!S9=\"Red\",'VRU Headform'!S9=\"D Red\"),\"Red\",IF(OR('VRU Headform'!S9=\"Green\",'VRU Headform'!S9=\"D Green\"),\"Green\",'VRU Headform'!S9)))","v":0},{"$f":"IF(NOT('VRU Headform'!T9=\"Blue\"),IF(OR('VRU Headform'!T9=\"Red\",'VRU Headform'!T9=\"D Red\"),\"Red\",IF(OR('VRU Headform'!T9=\"Green\",'VRU Headform'!T9=\"D Green\"),\"Green\",'VRU Headform'!T9)))","v":0},{"$f":"IF(NOT('VRU Headform'!U9=\"Blue\"),IF(OR('VRU Headform'!U9=\"Red\",'VRU Headform'!U9=\"D Red\"),\"Red\",IF(OR('VRU Headform'!U9=\"Green\",'VRU Headform'!U9=\"D Green\"),\"Green\",'VRU Headform'!U9)))","v":0},{"$f":"IF(NOT('VRU Headform'!V9=\"Blue\"),IF(OR('VRU Headform'!V9=\"Red\",'VRU Headform'!V9=\"D Red\"),\"Red\",IF(OR('VRU Headform'!V9=\"Green\",'VRU Headform'!V9=\"D Green\"),\"Green\",'VRU Headform'!V9)))","v":0},{"$f":"IF(NOT('VRU Headform'!W9=\"Blue\"),IF(OR('VRU Headform'!W9=\"Red\",'VRU Headform'!W9=\"D Red\"),\"Red\",IF(OR('VRU Headform'!W9=\"Green\",'VRU Headform'!W9=\"D Green\"),\"Green\",'VRU Headform'!W9)))","v":0},{"$f":"IF(NOT('VRU Headform'!X9=\"Blue\"),IF(OR('VRU Headform'!X9=\"Red\",'VRU Headform'!X9=\"D Red\"),\"Red\",IF(OR('VRU Headform'!X9=\"Green\",'VRU Headform'!X9=\"D Green\"),\"Green\",'VRU Headform'!X9)))","v":0},{"$f":"IF(NOT('VRU Headform'!Y9=\"Blue\"),IF(OR('VRU Headform'!Y9=\"Red\",'VRU Headform'!Y9=\"D Red\"),\"Red\",IF(OR('VRU Headform'!Y9=\"Green\",'VRU Headform'!Y9=\"D Green\"),\"Green\",'VRU Headform'!Y9)))","v":0},"No"]
[null,null,9,{"$f":"IF(NOT('VRU Headform'!E10=\"Blue\"),IF(OR('VRU Headform'!E10=\"Red\",'VRU Headform'!E10=\"D Red\"),\"Red\",IF(OR('VRU Headform'!E10=\"Green\",'VRU Headform'!E10=\"D Green\"),\"Green\",'VRU Headform'!E10)))","v":0},{"$f":"IF(NOT('VRU Headform'!F10=\"Blue\"),IF(OR('VRU Headform'!F10=\"Red\",'VRU Headform'!F10=\"D Red\"),\"Red\",IF(OR('VRU Headform'!F10=\"Green\",'VRU Headform'!F10=\"D Green\"),\"Green\",'VRU Headform'!F10)))","v":0},{"$f":"IF(NOT('VRU Headform'!G10=\"Blue\"),IF(OR('VRU Headform'!G10=\"Red\",'VRU Headform'!G10=\"D Red\"),\"Red\",IF(OR('VRU Headform'!G10=\"Green\",'VRU Headform'!G10=\"D Green\"),\"Green\",'VRU Headform'!G10)))","v":0},{"$f":"IF(NOT('VRU Headform'!H10=\"Blue\"),IF(OR('VRU Headform'!H10=\"Red\",'VRU Headform'!H10=\"D Red\"),\"Red\",IF(OR('VRU Headform'!H10=\"Green\",'VRU Headform'!H10=\"D Green\"),\"Green\",'VRU Headform'!H10)))","v":0},{"$f":"IF(NOT('VRU Headform'!I10=\"Blue\"),IF(OR('VRU Headform'!I10=\"Red\",'VRU Headform'!I10=\"D Red\"),\"Red\",IF(OR('VRU Headform'!I10=\"Green\",'VRU Headform'!I10=\"D Green\"),\"Green\",'VRU Headform'!I10)))","v":0},{"$f":"IF(NOT('VRU Headform'!J10=\"Blue\"),IF(OR('VRU Headform'!J10=\"Red\",'VRU Headform'!J10=\"D Red\"),\"Red\",IF(OR('VRU Headform'!J10=\"Green\",'VRU Headform'!J10=\"D Green\"),\"Green\",'VRU Headform'!J10)))","v":0},{"$f":"IF(NOT('VRU Headform'!K10=\"Blue\"),IF(OR('VRU Headform'!K10=\"Red\",'VRU Headform'!K10=\"D Red\"),\"Red\",IF(OR('VRU Headform'!K10=\"Green\",'VRU Headform'!K10=\"D Green\"),\"Green\",'VRU Headform'!K10)))","v":0},{"$f":"IF(NOT('VRU Headform'!L10=\"Blue\"),IF(OR('VRU Headform'!L10=\"Red\",'VRU Headform'!L10=\"D Red\"),\"Red\",IF(OR('VRU Headform'!L10=\"Green\",'VRU Headform'!L10=\"D Green\"),\"Green\",'VRU Headform'!L10)))","v":0},{"$f":"IF(NOT('VRU Headform'!M10=\"Blue\"),IF(OR('VRU Headform'!M10=\"Red\",'VRU Headform'!M10=\"D Red\"),\"Red\",IF(OR('VRU Headform'!M10=\"Green\",'VRU Headform'!M10=\"D Green\"),\"Green\",'VRU Headform'!M10)))","v":0},{"$f":"IF(NOT('VRU Headform'!N10=\"Blue\"),IF(OR('VRU Headform'!N10=\"Red\",'VRU Headform'!N10=\"D Red\"),\"Red\",IF(OR('VRU Headform'!N10=\"Green\",'VRU Headform'!N10=\"D Green\"),\"Green\",'VRU Headform'!N10)))","v":0},{"$f":"IF(NOT('VRU Headform'!O10=\"Blue\"),IF(OR('VRU Headform'!O10=\"Red\",'VRU Headform'!O10=\"D Red\"),\"Red\",IF(OR('VRU Headform'!O10=\"Green\",'VRU Headform'!O10=\"D Green\"),\"Green\",'VRU Headform'!O10)))","v":0},{"$f":"IF(NOT('VRU Headform'!P10=\"Blue\"),IF(OR('VRU Headform'!P10=\"Red\",'VRU Headform'!P10=\"D Red\"),\"Red\",IF(OR('VRU Headform'!P10=\"Green\",'VRU Headform'!P10=\"D Green\"),\"Green\",'VRU Headform'!P10)))","v":0},{"$f":"IF(NOT('VRU Headform'!Q10=\"Blue\"),IF(OR('VRU Headform'!Q10=\"Red\",'VRU Headform'!Q10=\"D Red\"),\"Red\",IF(OR('VRU Headform'!Q10=\"Green\",'VRU Headform'!Q10=\"D Green\"),\"Green\",'VRU Headform'!Q10)))","v":0},{"$f":"IF(NOT('VRU Headform'!R10=\"Blue\"),IF(OR('VRU Headform'!R10=\"Red\",'VRU Headform'!R10=\"D Red\"),\"Red\",IF(OR('VRU Headform'!R10=\"Green\",'VRU Headform'!R10=\"D Green\"),\"Green\",'VRU Headform'!R10)))","v":0},{"$f":"IF(NOT('VRU Headform'!S10=\"Blue\"),IF(OR('VRU Headform'!S10=\"Red\",'VRU Headform'!S10=\"D Red\"),\"Red\",IF(OR('VRU Headform'!S10=\"Green\",'VRU Headform'!S10=\"D Green\"),\"Green\",'VRU Headform'!S10)))","v":0},{"$f":"IF(NOT('VRU Headform'!T10=\"Blue\"),IF(OR('VRU Headform'!T10=\"Red\",'VRU Headform'!T10=\"D Red\"),\"Red\",IF(OR('VRU Headform'!T10=\"Green\",'VRU Headform'!T10=\"D Green\"),\"Green\",'VRU Headform'!T10)))","v":0},{"$f":"IF(NOT('VRU Headform'!U10=\"Blue\"),IF(OR('VRU Headform'!U10=\"Red\",'VRU Headform'!U10=\"D Red\"),\"Red\",IF(OR('VRU Headform'!U10=\"Green\",'VRU Headform'!U10=\"D Green\"),\"Green\",'VRU Headform'!U10)))","v":0},{"$f":"IF(NOT('VRU Headform'!V10=\"Blue\"),IF(OR('VRU Headform'!V10=\"Red\",'VRU Headform'!V10=\"D Red\"),\"Red\",IF(OR('VRU Headform'!V10=\"Green\",'VRU Headform'!V10=\"D Green\"),\"Green\",'VRU Headform'!V10)))","v":0},{"$f":"IF(NOT('VRU Headform'!W10=\"Blue\"),IF(OR('VRU Headform'!W10=\"Red\",'VRU Headform'!W10=\"D Red\"),\"Red\",IF(OR('VRU Headform'!W10=\"Green\",'VRU Headform'!W10=\"D Green\"),\"Green\",'VRU Headform'!W10)))","v":0},{"$f":"IF(NOT('VRU Headform'!X10=\"Blue\"),IF(OR('VRU Headform'!X10=\"Red\",'VRU Headform'!X10=\"D Red\"),\"Red\",IF(OR('VRU Headform'!X10=\"Green\",'VRU Headform'!X10=\"D Green\"),\"Green\",'VRU Headform'!X10)))","v":0},{"$f":"IF(NOT('VRU Headform'!Y10=\"Blue\"),IF(OR('VRU Headform'!Y10=\"Red\",'VRU Headform'!Y10=\"D Red\"),\"Red\",IF(OR('VRU Headform'!Y10=\"Green\",'VRU Headform'!Y10=\"D Green\"),\"Green\",'VRU Headform'!Y10)))","v":0},"No"]
[null,null,8,{"$f":"IF(NOT('VRU Headform'!E11=\"Blue\"),IF(OR('VRU Headform'!E11=\"Red\",'VRU Headform'!E11=\"D Red\"),\"Red\",IF(OR('VRU Headform'!E11=\"Green\",'VRU Headform'!E11=\"D Green\"),\"Green\",'VRU Headform'!E11)))","v":0},{"$f":"IF(NOT('VRU Headform'!F11=\"Blue\"),IF(OR('VRU Headform'!F11=\"Red\",'VRU Headform'!F11=\"D Red\"),\"Red\",IF(OR('VRU Headform'!F11=\"Green\",'VRU Headform'!F11=\"D Green\"),\"Green\",'VRU Headform'!F11)))","v":0},{"$f":"IF(NOT('VRU Headform'!G11=\"Blue\"),IF(OR('VRU Headform'!G11=\"Red\",'VRU Headform'!G11=\"D Red\"),\"Red\",IF(OR('VRU Headform'!G11=\"Green\",'VRU Headform'!G11=\"D Green\"),\"Green\",'VRU Headform'!G11)))","v":0},{"$f":"IF(NOT('VRU Headform'!H11=\"Blue\"),IF(OR('VRU Headform'!H11=\"Red\",'VRU Headform'!H11=\"D Red\"),\"Red\",IF(OR('VRU Headform'!H11=\"Green\",'VRU Headform'!H11=\"D Green\"),\"Green\",'VRU Headform'!H11)))","v":0},{"$f":"IF(NOT('VRU Headform'!I11=\"Blue\"),IF(OR('VRU Headform'!I11=\"Red\",'VRU Headform'!I11=\"D Red\"),\"Red\",IF(OR('VRU Headform'!I11=\"Green\",'VRU Headform'!I11=\"D Green\"),\"Green\",'VRU Headform'!I11)))","v":0},{"$f":"IF(NOT('VRU Headform'!J11=\"Blue\"),IF(OR('VRU Headform'!J11=\"Red\",'VRU Headform'!J11=\"D Red\"),\"Red\",IF(OR('VRU Headform'!J11=\"Green\",'VRU Headform'!J11=\"D Green\"),\"Green\",'VRU Headform'!J11)))","v":0},{"$f":"IF(NOT('VRU Headform'!K11=\"Blue\"),IF(OR('VRU Headform'!K11=\"Red\",'VRU Headform'!K11=\"D Red\"),\"Red\",IF(OR('VRU Headform'!K11=\"Green\",'VRU Headform'!K11=\"D Green\"),\"Green\",'VRU Headform'!K11)))","v":0},{"$f":"IF(NOT('VRU Headform'!L11=\"Blue\"),IF(OR('VRU Headform'!L11=\"Red\",'VRU Headform'!L11=\"D Red\"),\"Red\",IF(OR('VRU Headform'!L11=\"Green\",'VRU Headform'!L11=\"D Green\"),\"Green\",'VRU Headform'!L11)))","v":0},{"$f":"IF(NOT('VRU Headform'!M11=\"Blue\"),IF(OR('VRU Headform'!M11=\"Red\",'VRU Headform'!M11=\"D Red\"),\"Red\",IF(OR('VRU Headform'!M11=\"Green\",'VRU Headform'!M11=\"D Green\"),\"Green\",'VRU Headform'!M11)))","v":0},{"$f":"IF(NOT('VRU Headform'!N11=\"Blue\"),IF(OR('VRU Headform'!N11=\"Red\",'VRU Headform'!N11=\"D Red\"),\"Red\",IF(OR('VRU Headform'!N11=\"Green\",'VRU Headform'!N11=\"D Green\"),\"Green\",'VRU Headform'!N11)))","v":0},{"$f":"IF(NOT('VRU Headform'!O11=\"Blue\"),IF(OR('VRU Headform'!O11=\"Red\",'VRU Headform'!O11=\"D Red\"),\"Red\",IF(OR('VRU Headform'!O11=\"Green\",'VRU Headform'!O11=\"D Green\"),\"Green\",'VRU Headform'!O11)))","v":0},{"$f":"IF(NOT('VRU Headform'!P11=\"Blue\"),IF(OR('VRU Headform'!P11=\"Red\",'VRU Headform'!P11=\"D Red\"),\"Red\",IF(OR('VRU Headform'!P11=\"Green\",'VRU Headform'!P11=\"D Green\"),\"Green\",'VRU Headform'!P11)))","v":0},{"$f":"IF(NOT('VRU Headform'!Q11=\"Blue\"),IF(OR('VRU Headform'!Q11=\"Red\",'VRU Headform'!Q11=\"D Red\"),\"Red\",IF(OR('VRU Headform'!Q11=\"Green\",'VRU Headform'!Q11=\"D Green\"),\"Green\",'VRU Headform'!Q11)))","v":0},{"$f":"IF(NOT('VRU Headform'!R11=\"Blue\"),IF(OR('VRU Headform'!R11=\"Red\",'VRU Headform'!R11=\"D Red\"),\"Red\",IF(OR('VRU Headform'!R11=\"Green\",'VRU Headform'!R11=\"D Green\"),\"Green\",'VRU Headform'!R11)))","v":0},{"$f":"IF(NOT('VRU Headform'!S11=\"Blue\"),IF(OR('VRU Headform'!S11=\"Red\",'VRU Headform'!S11=\"D Red\"),\"Red\",IF(OR('VRU Headform'!S11=\"Green\",'VRU Headform'!S11=\"D Green\"),\"Green\",'VRU Headform'!S11)))","v":0},{"$f":"IF(NOT('VRU Headform'!T11=\"Blue\"),IF(OR('VRU Headform'!T11=\"Red\",'VRU Headform'!T11=\"D Red\"),\"Red\",IF(OR('VRU Headform'!T11=\"Green\",'VRU Headform'!T11=\"D Green\"),\"Green\",'VRU Headform'!T11)))","v":0},{"$f":"IF(NOT('VRU Headform'!U11=\"Blue\"),IF(OR('VRU Headform'!U11=\"Red\",'VRU Headform'!U11=\"D Red\"),\"Red\",IF(OR('VRU Headform'!U11=\"Green\",'VRU Headform'!U11=\"D Green\"),\"Green\",'VRU Headform'!U11)))","v":0},{"$f":"IF(NOT('VRU Headform'!V11=\"Blue\"),IF(OR('VRU Headform'!V11=\"Red\",'VRU Headform'!V11=\"D Red\"),\"Red\",IF(OR('VRU Headform'!V11=\"Green\",'VRU Headform'!V11=\"D Green\"),\"Green\",'VRU Headform'!V11)))","v":0},{"$f":"IF(NOT('VRU Headform'!W11=\"Blue\"),IF(OR('VRU Headform'!W11=\"Red\",'VRU Headform'!W11=\"D Red\"),\"Red\",IF(OR('VRU Headform'!W11=\"Green\",'VRU Headform'!W11=\"D Green\"),\"Green\",'VRU Headform'!W11)))","v":0},{"$f":"IF(NOT('VRU Headform'!X11=\"Blue\"),IF(OR('VRU Headform'!X11=\"Red\",'VRU Headform'!X11=\"D Red\"),\"Red\",IF(OR('VRU Headform'!X11=\"Green\",'VRU Headform'!X11=\"D Green\"),\"Green\",'VRU Headform'!X11)))","v":0},{"$f":"IF(NOT('VRU Headform'!Y11=\"Blue\"),IF(OR('VRU Headform'!Y11=\"Red\",'VRU Headform'!Y11=\"D Red\"),\"Red\",IF(OR('VRU Headform'!Y11=\"Green\",'VRU Headform'!Y11=\"D Green\"),\"Green\",'VRU Headform'!Y11)))","v":0},"No"]
[null,null,7,{"$f":"IF(NOT('VRU Headform'!E12=\"Blue\"),IF(OR('VRU Headform'!E12=\"Red\",'VRU Headform'!E12=\"D Red\"),\"Red\",IF(OR('VRU Headform'!E12=\"Green\",'VRU Headform'!E12=\"D Green\"),\"Green\",'VRU Headform'!E12)))","v":0},{"$f":"IF(NOT('VRU Headform'!F12=\"Blue\"),IF(OR('VRU Headform'!F12=\"Red\",'VRU Headform'!F12=\"D Red\"),\"Red\",IF(OR('VRU Headform'!F12=\"Green\",'VRU Headform'!F12=\"D Green\"),\"Green\",'VRU Headform'!F12)))","v":0},{"$f":"IF(NOT('VRU Headform'!G12=\"Blue\"),IF(OR('VRU Headform'!G12=\"Red\",'VRU Headform'!G12=\"D Red\"),\"Red\",IF(OR('VRU Headform'!G12=\"Green\",'VRU Headform'!G12=\"D Green\"),\"Green\",'VRU Headform'!G12)))","v":0},{"$f":"IF(NOT('VRU Headform'!H12=\"Blue\"),IF(OR('VRU Headform'!H12=\"Red\",'VRU Headform'!H12=\"D Red\"),\"Red\",IF(OR('VRU Headform'!H12=\"Green\",'VRU Headform'!H12=\"D Green\"),\"Green\",'VRU Headform'!H12)))","v":0},{"$f":"IF(NOT('VRU Headform'!I12=\"Blue\"),IF(OR('VRU Headform'!I12=\"Red\",'VRU Headform'!I12=\"D Red\"),\"Red\",IF(OR('VRU Headform'!I12=\"Green\",'VRU Headform'!I12=\"D Green\"),\"Green\",'VRU Headform'!I12)))","v":0},{"$f":"IF(NOT('VRU Headform'!J12=\"Blue\"),IF(OR('VRU Headform'!J12=\"Red\",'VRU Headform'!J12=\"D Red\"),\"Red\",IF(OR('VRU Headform'!J12=\"Green\",'VRU Headform'!J12=\"D Green\"),\"Green\",'VRU Headform'!J12)))","v":0},{"$f":"IF(NOT('VRU Headform'!K12=\"Blue\"),IF(OR('VRU Headform'!K12=\"Red\",'VRU Headform'!K12=\"D Red\"),\"Red\",IF(OR('VRU Headform'!K12=\"Green\",'VRU Headform'!K12=\"D Green\"),\"Green\",'VRU Headform'!K12)))","v":0},{"$f":"IF(NOT('VRU Headform'!L12=\"Blue\"),IF(OR('VRU Headform'!L12=\"Red\",'VRU Headform'!L12=\"D Red\"),\"Red\",IF(OR('VRU Headform'!L12=\"Green\",'VRU Headform'!L12=\"D Green\"),\"Green\",'VRU Headform'!L12)))","v":0},{"$f":"IF(NOT('VRU Headform'!M12=\"Blue\"),IF(OR('VRU Headform'!M12=\"Red\",'VRU Headform'!M12=\"D Red\"),\"Red\",IF(OR('VRU Headform'!M12=\"Green\",'VRU Headform'!M12=\"D Green\"),\"Green\",'VRU Headform'!M12)))","v":0},{"$f":"IF(NOT('VRU Headform'!N12=\"Blue\"),IF(OR('VRU Headform'!N12=\"Red\",'VRU Headform'!N12=\"D Red\"),\"Red\",IF(OR('VRU Headform'!N12=\"Green\",'VRU Headform'!N12=\"D Green\"),\"Green\",'VRU Headform'!N12)))","v":0},{"$f":"IF(NOT('VRU Headform'!O12=\"Blue\"),IF(OR('VRU Headform'!O12=\"Red\",'VRU Headform'!O12=\"D Red\"),\"Red\",IF(OR('VRU Headform'!O12=\"Green\",'VRU Headform'!O12=\"D Green\"),\"Green\",'VRU Headform'!O12)))","v":0},{"$f":"IF(NOT('VRU Headform'!P12=\"Blue\"),IF(OR('VRU Headform'!P12=\"Red\",'VRU Headform'!P12=\"D Red\"),\"Red\",IF(OR('VRU Headform'!P12=\"Green\",'VRU Headform'!P12=\"D Green\"),\"Green\",'VRU Headform'!P12)))","v":0},{"$f":"IF(NOT('VRU Headform'!Q12=\"Blue\"),IF(OR('VRU Headform'!Q12=\"Red\",'VRU Headform'!Q12=\"D Red\"),\"Red\",IF(OR('VRU Headform'!Q12=\"Green\",'VRU Headform'!Q12=\"D Green\"),\"Green\",'VRU Headform'!Q12)))","v":0},{"$f":"IF(NOT('VRU Headform'!R12=\"Blue\"),IF(OR('VRU Headform'!R12=\"Red\",'VRU Headform'!R12=\"D Red\"),\"Red\",IF(OR('VRU Headform'!R12=\"Green\",'VRU Headform'!R12=\"D Green\"),\"Green\",'VRU Headform'!R12)))","v":0},{"$f":"IF(NOT('VRU Headform'!S12=\"Blue\"),IF(OR('VRU Headform'!S12=\"Red\",'VRU Headform'!S12=\"D Red\"),\"Red\",IF(OR('VRU Headform'!S12=\"Green\",'VRU Headform'!S12=\"D Green\"),\"Green\",'VRU Headform'!S12)))","v":0},{"$f":"IF(NOT('VRU Headform'!T12=\"Blue\"),IF(OR('VRU Headform'!T12=\"Red\",'VRU Headform'!T12=\"D Red\"),\"Red\",IF(OR('VRU Headform'!T12=\"Green\",'VRU Headform'!T12=\"D Green\"),\"Green\",'VRU Headform'!T12)))","v":0},{"$f":"IF(NOT('VRU Headform'!U12=\"Blue\"),IF(OR('VRU Headform'!U12=\"Red\",'VRU Headform'!U12=\"D Red\"),\"Red\",IF(OR('VRU Headform'!U12=\"Green\",'VRU Headform'!U12=\"D Green\"),\"Green\",'VRU Headform'!U12)))","v":0},{"$f":"IF(NOT('VRU Headform'!V12=\"Blue\"),IF(OR('VRU Headform'!V12=\"Red\",'VRU Headform'!V12=\"D Red\"),\"Red\",IF(OR('VRU Headform'!V12=\"Green\",'VRU Headform'!V12=\"D Green\"),\"Green\",'VRU Headform'!V12)))","v":0},{"$f":"IF(NOT('VRU Headform'!W12=\"Blue\"),IF(OR('VRU Headform'!W12=\"Red\",'VRU Headform'!W12=\"D Red\"),\"Red\",IF(OR('VRU Headform'!W12=\"Green\",'VRU Headform'!W12=\"D Green\"),\"Green\",'VRU Headform'!W12)))","v":0},{"$f":"IF(NOT('VRU Headform'!X12=\"Blue\"),IF(OR('VRU Headform'!X12=\"Red\",'VRU Headform'!X12=\"D Red\"),\"Red\",IF(OR('VRU Headform'!X12=\"Green\",'VRU Headform'!X12=\"D Green\"),\"Green\",'VRU Headform'!X12)))","v":0},{"$f":"IF(NOT('VRU Headform'!Y12=\"Blue\"),IF(OR('VRU Headform'!Y12=\"Red\",'VRU Headform'!Y12=\"D Red\"),\"Red\",IF(OR('VRU Headform'!Y12=\"Green\",'VRU Headform'!Y12=\"D Green\"),\"Green\",'VRU Headform'!Y12)))","v":0},"No"]
[null,null,6,{"$f":"IF(NOT('VRU Headform'!E13=\"Blue\"),IF(OR('VRU Headform'!E13=\"Red\",'VRU Headform'!E13=\"D Red\"),\"Red\",IF(OR('VRU Headform'!E13=\"Green\",'VRU Headform'!E13=\"D Green\"),\"Green\",'VRU Headform'!E13)))","v":0},{"$f":"IF(NOT('VRU Headform'!F13=\"Blue\"),IF(OR('VRU Headform'!F13=\"Red\",'VRU Headform'!F13=\"D Red\"),\"Red\",IF(OR('VRU Headform'!F13=\"Green\",'VRU Headform'!F13=\"D Green\"),\"Green\",'VRU Headform'!F13)))","v":0},{"$f":"IF(NOT('VRU Headform'!G13=\"Blue\"),IF(OR('VRU Headform'!G13=\"Red\",'VRU Headform'!G13=\"D Red\"),\"Red\",IF(OR('VRU Headform'!G13=\"Green\",'VRU Headform'!G13=\"D Green\"),\"Green\",'VRU Headform'!G13)))","v":0},{"$f":"IF(NOT('VRU Headform'!H13=\"Blue\"),IF(OR('VRU Headform'!H13=\"Red\",'VRU Headform'!H13=\"D Red\"),\"Red\",IF(OR('VRU Headform'!H13=\"Green\",'VRU Headform'!H13=\"D Green\"),\"Green\",'VRU Headform'!H13)))","v":0},{"$f":"IF(NOT('VRU Headform'!I13=\"Blue\"),IF(OR('VRU Headform'!I13=\"Red\",'VRU Headform'!I13=\"D Red\"),\"Red\",IF(OR('VRU Headform'!I13=\"Green\",'VRU Headform'!I13=\"D Green\"),\"Green\",'VRU Headform'!I13)))","v":0},{"$f":"IF(NOT('VRU Headform'!J13=\"Blue\"),IF(OR('VRU Headform'!J13=\"Red\",'VRU Headform'!J13=\"D Red\"),\"Red\",IF(OR('VRU Headform'!J13=\"Green\",'VRU Headform'!J13=\"D Green\"),\"Green\",'VRU Headform'!J13)))","v":0},{"$f":"IF(NOT('VRU Headform'!K13=\"Blue\"),IF(OR('VRU Headform'!K13=\"Red\",'VRU Headform'!K13=\"D Red\"),\"Red\",IF(OR('VRU Headform'!K13=\"Green\",'VRU Headform'!K13=\"D Green\"),\"Green\",'VRU Headform'!K13)))","v":0},{"$f":"IF(NOT('VRU Headform'!L13=\"Blue\"),IF(OR('VRU Headform'!L13=\"Red\",'VRU Headform'!L13=\"D Red\"),\"Red\",IF(OR('VRU Headform'!L13=\"Green\",'VRU Headform'!L13=\"D Green\"),\"Green\",'VRU Headform'!L13)))","v":0},{"$f":"IF(NOT('VRU Headform'!M13=\"Blue\"),IF(OR('VRU Headform'!M13=\"Red\",'VRU Headform'!M13=\"D Red\"),\"Red\",IF(OR('VRU Headform'!M13=\"Green\",'VRU Headform'!M13=\"D Green\"),\"Green\",'VRU Headform'!M13)))","v":0},{"$f":"IF(NOT('VRU Headform'!N13=\"Blue\"),IF(OR('VRU Headform'!N13=\"Red\",'VRU Headform'!N13=\"D Red\"),\"Red\",IF(OR('VRU Headform'!N13=\"Green\",'VRU Headform'!N13=\"D Green\"),\"Green\",'VRU Headform'!N13)))","v":0},{"$f":"IF(NOT('VRU Headform'!O13=\"Blue\"),IF(OR('VRU Headform'!O13=\"Red\",'VRU Headform'!O13=\"D Red\"),\"Red\",IF(OR('VRU Headform'!O13=\"Green\",'VRU Headform'!O13=\"D Green\"),\"Green\",'VRU Headform'!O13)))","v":0},{"$f":"IF(NOT('VRU Headform'!P13=\"Blue\"),IF(OR('VRU Headform'!P13=\"Red\",'VRU Headform'!P13=\"D Red\"),\"Red\",IF(OR('VRU Headform'!P13=\"Green\",'VRU Headform'!P13=\"D Green\"),\"Green\",'VRU Headform'!P13)))","v":0},{"$f":"IF(NOT('VRU Headform'!Q13=\"Blue\"),IF(OR('VRU Headform'!Q13=\"Red\",'VRU Headform'!Q13=\"D Red\"),\"Red\",IF(OR('VRU Headform'!Q13=\"Green\",'VRU Headform'!Q13=\"D Green\"),\"Green\",'VRU Headform'!Q13)))","v":0},{"$f":"IF(NOT('VRU Headform'!R13=\"Blue\"),IF(OR('VRU Headform'!R13=\"Red\",'VRU Headform'!R13=\"D Red\"),\"Red\",IF(OR('VRU Headform'!R13=\"Green\",'VRU Headform'!R13=\"D Green\"),\"Green\",'VRU Headform'!R13)))","v":0},{"$f":"IF(NOT('VRU Headform'!S13=\"Blue\"),IF(OR('VRU Headform'!S13=\"Red\",'VRU Headform'!S13=\"D Red\"),\"Red\",IF(OR('VRU Headform'!S13=\"Green\",'VRU Headform'!S13=\"D Green\"),\"Green\",'VRU Headform'!S13)))","v":0},{"$f":"IF(NOT('VRU Headform'!T13=\"Blue\"),IF(OR('VRU Headform'!T13=\"Red\",'VRU Headform'!T13=\"D Red\"),\"Red\",IF(OR('VRU Headform'!T13=\"Green\",'VRU Headform'!T13=\"D Green\"),\"Green\",'VRU Headform'!T13)))","v":0},{"$f":"IF(NOT('VRU Headform'!U13=\"Blue\"),IF(OR('VRU Headform'!U13=\"Red\",'VRU Headform'!U13=\"D Red\"),\"Red\",IF(OR('VRU Headform'!U13=\"Green\",'VRU Headform'!U13=\"D Green\"),\"Green\",'VRU Headform'!U13)))","v":0},{"$f":"IF(NOT('VRU Headform'!V13=\"Blue\"),IF(OR('VRU Headform'!V13=\"Red\",'VRU Headform'!V13=\"D Red\"),\"Red\",IF(OR('VRU Headform'!V13=\"Green\",'VRU Headform'!V13=\"D Green\"),\"Green\",'VRU Headform'!V13)))","v":0},{"$f":"IF(NOT('VRU Headform'!W13=\"Blue\"),IF(OR('VRU Headform'!W13=\"Red\",'VRU Headform'!W13=\"D Red\"),\"Red\",IF(OR('VRU Headform'!W13=\"Green\",'VRU Headform'!W13=\"D Green\"),\"Green\",'VRU Headform'!W13)))","v":0},{"$f":"IF(NOT('VRU Headform'!X13=\"Blue\"),IF(OR('VRU Headform'!X13=\"Red\",'VRU Headform'!X13=\"D Red\"),\"Red\",IF(OR('VRU Headform'!X13=\"Green\",'VRU Headform'!X13=\"D Green\"),\"Green\",'VRU Headform'!X13)))","v":0},{"$f":"IF(NOT('VRU Headform'!Y13=\"Blue\"),IF(OR('VRU Headform'!Y13=\"Red\",'VRU Headform'!Y13=\"D Red\"),\"Red\",IF(OR('VRU Headform'!Y13=\"Green\",'VRU Headform'!Y13=\"D Green\"),\"Green\",'VRU Headform'!Y13)))","v":0},"No"]
[null,null,5,{"$f":"IF(NOT('VRU Headform'!E14=\"Blue\"),IF(OR('VRU Headform'!E14=\"Red\",'VRU Headform'!E14=\"D Red\"),\"Red\",IF(OR('VRU Headform'!E14=\"Green\",'VRU Headform'!E14=\"D Green\"),\"Green\",'VRU Headform'!E14)))","v":0},{"$f":"IF(NOT('VRU Headform'!F14=\"Blue\"),IF(OR('VRU Headform'!F14=\"Red\",'VRU Headform'!F14=\"D Red\"),\"Red\",IF(OR('VRU Headform'!F14=\"Green\",'VRU Headform'!F14=\"D Green\"),\"Green\",'VRU Headform'!F14)))","v":0},{"$f":"IF(NOT('VRU Headform'!G14=\"Blue\"),IF(OR('VRU Headform'!G14=\"Red\",'VRU Headform'!G14=\"D Red\"),\"Red\",IF(OR('VRU Headform'!G14=\"Green\",'VRU Headform'!G14=\"D Green\"),\"Green\",'VRU Headform'!G14)))","v":0},{"$f":"IF(NOT('VRU Headform'!H14=\"Blue\"),IF(OR('VRU Headform'!H14=\"Red\",'VRU Headform'!H14=\"D Red\"),\"Red\",IF(OR('VRU Headform'!H14=\"Green\",'VRU Headform'!H14=\"D Green\"),\"Green\",'VRU Headform'!H14)))","v":0},{"$f":"IF(NOT('VRU Headform'!I14=\"Blue\"),IF(OR('VRU Headform'!I14=\"Red\",'VRU Headform'!I14=\"D Red\"),\"Red\",IF(OR('VRU Headform'!I14=\"Green\",'VRU Headform'!I14=\"D Green\"),\"Green\",'VRU Headform'!I14)))","v":0},{"$f":"IF(NOT('VRU Headform'!J14=\"Blue\"),IF(OR('VRU Headform'!J14=\"Red\",'VRU Headform'!J14=\"D Red\"),\"Red\",IF(OR('VRU Headform'!J14=\"Green\",'VRU Headform'!J14=\"D Green\"),\"Green\",'VRU Headform'!J14)))","v":0},{"$f":"IF(NOT('VRU Headform'!K14=\"Blue\"),IF(OR('VRU Headform'!K14=\"Red\",'VRU Headform'!K14=\"D Red\"),\"Red\",IF(OR('VRU Headform'!K14=\"Green\",'VRU Headform'!K14=\"D Green\"),\"Green\",'VRU Headform'!K14)))","v":0},{"$f":"IF(NOT('VRU Headform'!L14=\"Blue\"),IF(OR('VRU Headform'!L14=\"Red\",'VRU Headform'!L14=\"D Red\"),\"Red\",IF(OR('VRU Headform'!L14=\"Green\",'VRU Headform'!L14=\"D Green\"),\"Green\",'VRU Headform'!L14)))","v":0},{"$f":"IF(NOT('VRU Headform'!M14=\"Blue\"),IF(OR('VRU Headform'!M14=\"Red\",'VRU Headform'!M14=\"D Red\"),\"Red\",IF(OR('VRU Headform'!M14=\"Green\",'VRU Headform'!M14=\"D Green\"),\"Green\",'VRU Headform'!M14)))","v":0},{"$f":"IF(NOT('VRU Headform'!N14=\"Blue\"),IF(OR('VRU Headform'!N14=\"Red\",'VRU Headform'!N14=\"D Red\"),\"Red\",IF(OR('VRU Headform'!N14=\"Green\",'VRU Headform'!N14=\"D Green\"),\"Green\",'VRU Headform'!N14)))","v":0},{"$f":"IF(NOT('VRU Headform'!O14=\"Blue\"),IF(OR('VRU Headform'!O14=\"Red\",'VRU Headform'!O14=\"D Red\"),\"Red\",IF(OR('VRU Headform'!O14=\"Green\",'VRU Headform'!O14=\"D Green\"),\"Green\",'VRU Headform'!O14)))","v":0},{"$f":"IF(NOT('VRU Headform'!P14=\"Blue\"),IF(OR('VRU Headform'!P14=\"Red\",'VRU Headform'!P14=\"D Red\"),\"Red\",IF(OR('VRU Headform'!P14=\"Green\",'VRU Headform'!P14=\"D Green\"),\"Green\",'VRU Headform'!P14)))","v":0},{"$f":"IF(NOT('VRU Headform'!Q14=\"Blue\"),IF(OR('VRU Headform'!Q14=\"Red\",'VRU Headform'!Q14=\"D Red\"),\"Red\",IF(OR('VRU Headform'!Q14=\"Green\",'VRU Headform'!Q14=\"D Green\"),\"Green\",'VRU Headform'!Q14)))","v":0},{"$f":"IF(NOT('VRU Headform'!R14=\"Blue\"),IF(OR('VRU Headform'!R14=\"Red\",'VRU Headform'!R14=\"D Red\"),\"Red\",IF(OR('VRU Headform'!R14=\"Green\",'VRU Headform'!R14=\"D Green\"),\"Green\",'VRU Headform'!R14)))","v":0},{"$f":"IF(NOT('VRU Headform'!S14=\"Blue\"),IF(OR('VRU Headform'!S14=\"Red\",'VRU Headform'!S14=\"D Red\"),\"Red\",IF(OR('VRU Headform'!S14=\"Green\",'VRU Headform'!S14=\"D Green\"),\"Green\",'VRU Headform'!S14)))","v":0},{"$f":"IF(NOT('VRU Headform'!T14=\"Blue\"),IF(OR('VRU Headform'!T14=\"Red\",'VRU Headform'!T14=\"D Red\"),\"Red\",IF(OR('VRU Headform'!T14=\"Green\",'VRU Headform'!T14=\"D Green\"),\"Green\",'VRU Headform'!T14)))","v":0},{"$f":"IF(NOT('VRU Headform'!U14=\"Blue\"),IF(OR('VRU Headform'!U14=\"Red\",'VRU Headform'!U14=\"D Red\"),\"Red\",IF(OR('VRU Headform'!U14=\"Green\",'VRU Headform'!U14=\"D Green\"),\"Green\",'VRU Headform'!U14)))","v":0},{"$f":"IF(NOT('VRU Headform'!V14=\"Blue\"),IF(OR('VRU Headform'!V14=\"Red\",'VRU Headform'!V14=\"D Red\"),\"Red\",IF(OR('VRU Headform'!V14=\"Green\",'VRU Headform'!V14=\"D Green\"),\"Green\",'VRU Headform'!V14)))","v":0},{"$f":"IF(NOT('VRU Headform'!W14=\"Blue\"),IF(OR('VRU Headform'!W14=\"Red\",'VRU Headform'!W14=\"D Red\"),\"Red\",IF(OR('VRU Headform'!W14=\"Green\",'VRU Headform'!W14=\"D Green\"),\"Green\",'VRU Headform'!W14)))","v":0},{"$f":"IF(NOT('VRU Headform'!X14=\"Blue\"),IF(OR('VRU Headform'!X14=\"Red\",'VRU Headform'!X14=\"D Red\"),\"Red\",IF(OR('VRU Headform'!X14=\"Green\",'VRU Headform'!X14=\"D Green\"),\"Green\",'VRU Headform'!X14)))","v":0},{"$f":"IF(NOT('VRU Headform'!Y14=\"Blue\"),IF(OR('VRU Headform'!Y14=\"Red\",'VRU Headform'!Y14=\"D Red\"),\"Red\",IF(OR('VRU Headform'!Y14=\"Green\",'VRU Headform'!Y14=\"D Green\"),\"Green\",'VRU Headform'!Y14)))","v":0},"No"]
[null,null,4,{"$f":"IF(NOT('VRU Headform'!E15=\"Blue\"),IF(OR('VRU Headform'!E15=\"Red\",'VRU Headform'!E15=\"D Red\"),\"Red\",IF(OR('VRU Headform'!E15=\"Green\",'VRU Headform'!E15=\"D Green\"),\"Green\",'VRU Headform'!E15)))","v":0},{"$f":"IF(NOT('VRU Headform'!F15=\"Blue\"),IF(OR('VRU Headform'!F15=\"Red\",'VRU Headform'!F15=\"D Red\"),\"Red\",IF(OR('VRU Headform'!F15=\"Green\",'VRU Headform'!F15=\"D Green\"),\"Green\",'VRU Headform'!F15)))","v":0},{"$f":"IF(NOT('VRU Headform'!G15=\"Blue\"),IF(OR('VRU Headform'!G15=\"Red\",'VRU Headform'!G15=\"D Red\"),\"Red\",IF(OR('VRU Headform'!G15=\"Green\",'VRU Headform'!G15=\"D Green\"),\"Green\",'VRU Headform'!G15)))","v":0},{"$f":"IF(NOT('VRU Headform'!H15=\"Blue\"),IF(OR('VRU Headform'!H15=\"Red\",'VRU Headform'!H15=\"D Red\"),\"Red\",IF(OR('VRU Headform'!H15=\"Green\",'VRU Headform'!H15=\"D Green\"),\"Green\",'VRU Headform'!H15)))","v":0},{"$f":"IF(NOT('VRU Headform'!I15=\"Blue\"),IF(OR('VRU Headform'!I15=\"Red\",'VRU Headform'!I15=\"D Red\"),\"Red\",IF(OR('VRU Headform'!I15=\"Green\",'VRU Headform'!I15=\"D Green\"),\"Green\",'VRU Headform'!I15)))","v":0},{"$f":"IF(NOT('VRU Headform'!J15=\"Blue\"),IF(OR('VRU Headform'!J15=\"Red\",'VRU Headform'!J15=\"D Red\"),\"Red\",IF(OR('VRU Headform'!J15=\"Green\",'VRU Headform'!J15=\"D Green\"),\"Green\",'VRU Headform'!J15)))","v":0},{"$f":"IF(NOT('VRU Headform'!K15=\"Blue\"),IF(OR('VRU Headform'!K15=\"Red\",'VRU Headform'!K15=\"D Red\"),\"Red\",IF(OR('VRU Headform'!K15=\"Green\",'VRU Headform'!K15=\"D Green\"),\"Green\",'VRU Headform'!K15)))","v":0},{"$f":"IF(NOT('VRU Headform'!L15=\"Blue\"),IF(OR('VRU Headform'!L15=\"Red\",'VRU Headform'!L15=\"D Red\"),\"Red\",IF(OR('VRU Headform'!L15=\"Green\",'VRU Headform'!L15=\"D Green\"),\"Green\",'VRU Headform'!L15)))","v":0},{"$f":"IF(NOT('VRU Headform'!M15=\"Blue\"),IF(OR('VRU Headform'!M15=\"Red\",'VRU Headform'!M15=\"D Red\"),\"Red\",IF(OR('VRU Headform'!M15=\"Green\",'VRU Headform'!M15=\"D Green\"),\"Green\",'VRU Headform'!M15)))","v":0},{"$f":"IF(NOT('VRU Headform'!N15=\"Blue\"),IF(OR('VRU Headform'!N15=\"Red\",'VRU Headform'!N15=\"D Red\"),\"Red\",IF(OR('VRU Headform'!N15=\"Green\",'VRU Headform'!N15=\"D Green\"),\"Green\",'VRU Headform'!N15)))","v":0},{"$f":"IF(NOT('VRU Headform'!O15=\"Blue\"),IF(OR('VRU Headform'!O15=\"Red\",'VRU Headform'!O15=\"D Red\"),\"Red\",IF(OR('VRU Headform'!O15=\"Green\",'VRU Headform'!O15=\"D Green\"),\"Green\",'VRU Headform'!O15)))","v":0},{"$f":"IF(NOT('VRU Headform'!P15=\"Blue\"),IF(OR('VRU Headform'!P15=\"Red\",'VRU Headform'!P15=\"D Red\"),\"Red\",IF(OR('VRU Headform'!P15=\"Green\",'VRU Headform'!P15=\"D Green\"),\"Green\",'VRU Headform'!P15)))","v":0},{"$f":"IF(NOT('VRU Headform'!Q15=\"Blue\"),IF(OR('VRU Headform'!Q15=\"Red\",'VRU Headform'!Q15=\"D Red\"),\"Red\",IF(OR('VRU Headform'!Q15=\"Green\",'VRU Headform'!Q15=\"D Green\"),\"Green\",'VRU Headform'!Q15)))","v":0},{"$f":"IF(NOT('VRU Headform'!R15=\"Blue\"),IF(OR('VRU Headform'!R15=\"Red\",'VRU Headform'!R15=\"D Red\"),\"Red\",IF(OR('VRU Headform'!R15=\"Green\",'VRU Headform'!R15=\"D Green\"),\"Green\",'VRU Headform'!R15)))","v":0},{"$f":"IF(NOT('VRU Headform'!S15=\"Blue\"),IF(OR('VRU Headform'!S15=\"Red\",'VRU Headform'!S15=\"D Red\"),\"Red\",IF(OR('VRU Headform'!S15=\"Green\",'VRU Headform'!S15=\"D Green\"),\"Green\",'VRU Headform'!S15)))","v":0},{"$f":"IF(NOT('VRU Headform'!T15=\"Blue\"),IF(OR('VRU Headform'!T15=\"Red\",'VRU Headform'!T15=\"D Red\"),\"Red\",IF(OR('VRU Headform'!T15=\"Green\",'VRU Headform'!T15=\"D Green\"),\"Green\",'VRU Headform'!T15)))","v":0},{"$f":"IF(NOT('VRU Headform'!U15=\"Blue\"),IF(OR('VRU Headform'!U15=\"Red\",'VRU Headform'!U15=\"D Red\"),\"Red\",IF(OR('VRU Headform'!U15=\"Green\",'VRU Headform'!U15=\"D Green\"),\"Green\",'VRU Headform'!U15)))","v":0},{"$f":"IF(NOT('VRU Headform'!V15=\"Blue\"),IF(OR('VRU Headform'!V15=\"Red\",'VRU Headform'!V15=\"D Red\"),\"Red\",IF(OR('VRU Headform'!V15=\"Green\",'VRU Headform'!V15=\"D Green\"),\"Green\",'VRU Headform'!V15)))","v":0},{"$f":"IF(NOT('VRU Headform'!W15=\"Blue\"),IF(OR('VRU Headform'!W15=\"Red\",'VRU Headform'!W15=\"D Red\"),\"Red\",IF(OR('VRU Headform'!W15=\"Green\",'VRU Headform'!W15=\"D Green\"),\"Green\",'VRU Headform'!W15)))","v":0},{"$f":"IF(NOT('VRU Headform'!X15=\"Blue\"),IF(OR('VRU Headform'!X15=\"Red\",'VRU Headform'!X15=\"D Red\"),\"Red\",IF(OR('VRU Headform'!X15=\"Green\",'VRU Headform'!X15=\"D Green\"),\"Green\",'VRU Headform'!X15)))","v":0},{"$f":"IF(NOT('VRU Headform'!Y15=\"Blue\"),IF(OR('VRU Headform'!Y15=\"Red\",'VRU Headform'!Y15=\"D Red\"),\"Red\",IF(OR('VRU Headform'!Y15=\"Green\",'VRU Headform'!Y15=\"D Green\"),\"Green\",'VRU Headform'!Y15)))","v":0},"No"]
[null,null,3,{"$f":"IF(NOT('VRU Headform'!E16=\"Blue\"),IF(OR('VRU Headform'!E16=\"Red\",'VRU Headform'!E16=\"D Red\"),\"Red\",IF(OR('VRU Headform'!E16=\"Green\",'VRU Headform'!E16=\"D Green\"),\"Green\",'VRU Headform'!E16)))","v":0},{"$f":"IF(NOT('VRU Headform'!F16=\"Blue\"),IF(OR('VRU Headform'!F16=\"Red\",'VRU Headform'!F16=\"D Red\"),\"Red\",IF(OR('VRU Headform'!F16=\"Green\",'VRU Headform'!F16=\"D Green\"),\"Green\",'VRU Headform'!F16)))","v":0},{"$f":"IF(NOT('VRU Headform'!G16=\"Blue\"),IF(OR('VRU Headform'!G16=\"Red\",'VRU Headform'!G16=\"D Red\"),\"Red\",IF(OR('VRU Headform'!G16=\"Green\",'VRU Headform'!G16=\"D Green\"),\"Green\",'VRU Headform'!G16)))","v":0},{"$f":"IF(NOT('VRU Headform'!H16=\"Blue\"),IF(OR('VRU Headform'!H16=\"Red\",'VRU Headform'!H16=\"D Red\"),\"Red\",IF(OR('VRU Headform'!H16=\"Green\",'VRU Headform'!H16=\"D Green\"),\"Green\",'VRU Headform'!H16)))","v":0},{"$f":"IF(NOT('VRU Headform'!I16=\"Blue\"),IF(OR('VRU Headform'!I16=\"Red\",'VRU Headform'!I16=\"D Red\"),\"Red\",IF(OR('VRU Headform'!I16=\"Green\",'VRU Headform'!I16=\"D Green\"),\"Green\",'VRU Headform'!I16)))","v":0},{"$f":"IF(NOT('VRU Headform'!J16=\"Blue\"),IF(OR('VRU Headform'!J16=\"Red\",'VRU Headform'!J16=\"D Red\"),\"Red\",IF(OR('VRU Headform'!J16=\"Green\",'VRU Headform'!J16=\"D Green\"),\"Green\",'VRU Headform'!J16)))","v":0},{"$f":"IF(NOT('VRU Headform'!K16=\"Blue\"),IF(OR('VRU Headform'!K16=\"Red\",'VRU Headform'!K16=\"D Red\"),\"Red\",IF(OR('VRU Headform'!K16=\"Green\",'VRU Headform'!K16=\"D Green\"),\"Green\",'VRU Headform'!K16)))","v":0},{"$f":"IF(NOT('VRU Headform'!L16=\"Blue\"),IF(OR('VRU Headform'!L16=\"Red\",'VRU Headform'!L16=\"D Red\"),\"Red\",IF(OR('VRU Headform'!L16=\"Green\",'VRU Headform'!L16=\"D Green\"),\"Green\",'VRU Headform'!L16)))","v":0},{"$f":"IF(NOT('VRU Headform'!M16=\"Blue\"),IF(OR('VRU Headform'!M16=\"Red\",'VRU Headform'!M16=\"D Red\"),\"Red\",IF(OR('VRU Headform'!M16=\"Green\",'VRU Headform'!M16=\"D Green\"),\"Green\",'VRU Headform'!M16)))","v":0},{"$f":"IF(NOT('VRU Headform'!N16=\"Blue\"),IF(OR('VRU Headform'!N16=\"Red\",'VRU Headform'!N16=\"D Red\"),\"Red\",IF(OR('VRU Headform'!N16=\"Green\",'VRU Headform'!N16=\"D Green\"),\"Green\",'VRU Headform'!N16)))","v":0},{"$f":"IF(NOT('VRU Headform'!O16=\"Blue\"),IF(OR('VRU Headform'!O16=\"Red\",'VRU Headform'!O16=\"D Red\"),\"Red\",IF(OR('VRU Headform'!O16=\"Green\",'VRU Headform'!O16=\"D Green\"),\"Green\",'VRU Headform'!O16)))","v":0},{"$f":"IF(NOT('VRU Headform'!P16=\"Blue\"),IF(OR('VRU Headform'!P16=\"Red\",'VRU Headform'!P16=\"D Red\"),\"Red\",IF(OR('VRU Headform'!P16=\"Green\",'VRU Headform'!P16=\"D Green\"),\"Green\",'VRU Headform'!P16)))","v":0},{"$f":"IF(NOT('VRU Headform'!Q16=\"Blue\"),IF(OR('VRU Headform'!Q16=\"Red\",'VRU Headform'!Q16=\"D Red\"),\"Red\",IF(OR('VRU Headform'!Q16=\"Green\",'VRU Headform'!Q16=\"D Green\"),\"Green\",'VRU Headform'!Q16)))","v":0},{"$f":"IF(NOT('VRU Headform'!R16=\"Blue\"),IF(OR('VRU Headform'!R16=\"Red\",'VRU Headform'!R16=\"D Red\"),\"Red\",IF(OR('VRU Headform'!R16=\"Green\",'VRU Headform'!R16=\"D Green\"),\"Green\",'VRU Headform'!R16)))","v":0},{"$f":"IF(NOT('VRU Headform'!S16=\"Blue\"),IF(OR('VRU Headform'!S16=\"Red\",'VRU Headform'!S16=\"D Red\"),\"Red\",IF(OR('VRU Headform'!S16=\"Green\",'VRU Headform'!S16=\"D Green\"),\"Green\",'VRU Headform'!S16)))","v":0},{"$f":"IF(NOT('VRU Headform'!T16=\"Blue\"),IF(OR('VRU Headform'!T16=\"Red\",'VRU Headform'!T16=\"D Red\"),\"Red\",IF(OR('VRU Headform'!T16=\"Green\",'VRU Headform'!T16=\"D Green\"),\"Green\",'VRU Headform'!T16)))","v":0},{"$f":"IF(NOT('VRU Headform'!U16=\"Blue\"),IF(OR('VRU Headform'!U16=\"Red\",'VRU Headform'!U16=\"D Red\"),\"Red\",IF(OR('VRU Headform'!U16=\"Green\",'VRU Headform'!U16=\"D Green\"),\"Green\",'VRU Headform'!U16)))","v":0},{"$f":"IF(NOT('VRU Headform'!V16=\"Blue\"),IF(OR('VRU Headform'!V16=\"Red\",'VRU Headform'!V16=\"D Red\"),\"Red\",IF(OR('VRU Headform'!V16=\"Green\",'VRU Headform'!V16=\"D Green\"),\"Green\",'VRU Headform'!V16)))","v":0},{"$f":"IF(NOT('VRU Headform'!W16=\"Blue\"),IF(OR('VRU Headform'!W16=\"Red\",'VRU Headform'!W16=\"D Red\"),\"Red\",IF(OR('VRU Headform'!W16=\"Green\",'VRU Headform'!W16=\"D Green\"),\"Green\",'VRU Headform'!W16)))","v":0},{"$f":"IF(NOT('VRU Headform'!X16=\"Blue\"),IF(OR('VRU Headform'!X16=\"Red\",'VRU Headform'!X16=\"D Red\"),\"Red\",IF(OR('VRU Headform'!X16=\"Green\",'VRU Headform'!X16=\"D Green\"),\"Green\",'VRU Headform'!X16)))","v":0},{"$f":"IF(NOT('VRU Headform'!Y16=\"Blue\"),IF(OR('VRU Headform'!Y16=\"Red\",'VRU Headform'!Y16=\"D Red\"),\"Red\",IF(OR('VRU Headform'!Y16=\"Green\",'VRU Headform'!Y16=\"D Green\"),\"Green\",'VRU Headform'!Y16)))","v":0},"No"]
[null,null,2,{"$f":"IF(NOT('VRU Headform'!E17=\"Blue\"),IF(OR('VRU Headform'!E17=\"Red\",'VRU Headform'!E17=\"D Red\"),\"Red\",IF(OR('VRU Headform'!E17=\"Green\",'VRU Headform'!E17=\"D Green\"),\"Green\",'VRU Headform'!E17)))","v":0},{"$f":"IF(NOT('VRU Headform'!F17=\"Blue\"),IF(OR('VRU Headform'!F17=\"Red\",'VRU Headform'!F17=\"D Red\"),\"Red\",IF(OR('VRU Headform'!F17=\"Green\",'VRU Headform'!F17=\"D Green\"),\"Green\",'VRU Headform'!F17)))","v":0},{"$f":"IF(NOT('VRU Headform'!G17=\"Blue\"),IF(OR('VRU Headform'!G17=\"Red\",'VRU Headform'!G17=\"D Red\"),\"Red\",IF(OR('VRU Headform'!G17=\"Green\",'VRU Headform'!G17=\"D Green\"),\"Green\",'VRU Headform'!G17)))","v":0},{"$f":"IF(NOT('VRU Headform'!H17=\"Blue\"),IF(OR('VRU Headform'!H17=\"Red\",'VRU Headform'!H17=\"D Red\"),\"Red\",IF(OR('VRU Headform'!H17=\"Green\",'VRU Headform'!H17=\"D Green\"),\"Green\",'VRU Headform'!H17)))","v":0},{"$f":"IF(NOT('VRU Headform'!I17=\"Blue\"),IF(OR('VRU Headform'!I17=\"Red\",'VRU Headform'!I17=\"D Red\"),\"Red\",IF(OR('VRU Headform'!I17=\"Green\",'VRU Headform'!I17=\"D Green\"),\"Green\",'VRU Headform'!I17)))","v":0},{"$f":"IF(NOT('VRU Headform'!J17=\"Blue\"),IF(OR('VRU Headform'!J17=\"Red\",'VRU Headform'!J17=\"D Red\"),\"Red\",IF(OR('VRU Headform'!J17=\"Green\",'VRU Headform'!J17=\"D Green\"),\"Green\",'VRU Headform'!J17)))","v":0},{"$f":"IF(NOT('VRU Headform'!K17=\"Blue\"),IF(OR('VRU Headform'!K17=\"Red\",'VRU Headform'!K17=\"D Red\"),\"Red\",IF(OR('VRU Headform'!K17=\"Green\",'VRU Headform'!K17=\"D Green\"),\"Green\",'VRU Headform'!K17)))","v":0},{"$f":"IF(NOT('VRU Headform'!L17=\"Blue\"),IF(OR('VRU Headform'!L17=\"Red\",'VRU Headform'!L17=\"D Red\"),\"Red\",IF(OR('VRU Headform'!L17=\"Green\",'VRU Headform'!L17=\"D Green\"),\"Green\",'VRU Headform'!L17)))","v":0},{"$f":"IF(NOT('VRU Headform'!M17=\"Blue\"),IF(OR('VRU Headform'!M17=\"Red\",'VRU Headform'!M17=\"D Red\"),\"Red\",IF(OR('VRU Headform'!M17=\"Green\",'VRU Headform'!M17=\"D Green\"),\"Green\",'VRU Headform'!M17)))","v":0},{"$f":"IF(NOT('VRU Headform'!N17=\"Blue\"),IF(OR('VRU Headform'!N17=\"Red\",'VRU Headform'!N17=\"D Red\"),\"Red\",IF(OR('VRU Headform'!N17=\"Green\",'VRU Headform'!N17=\"D Green\"),\"Green\",'VRU Headform'!N17)))","v":0},{"$f":"IF(NOT('VRU Headform'!O17=\"Blue\"),IF(OR('VRU Headform'!O17=\"Red\",'VRU Headform'!O17=\"D Red\"),\"Red\",IF(OR('VRU Headform'!O17=\"Green\",'VRU Headform'!O17=\"D Green\"),\"Green\",'VRU Headform'!O17)))","v":0},{"$f":"IF(NOT('VRU Headform'!P17=\"Blue\"),IF(OR('VRU Headform'!P17=\"Red\",'VRU Headform'!P17=\"D Red\"),\"Red\",IF(OR('VRU Headform'!P17=\"Green\",'VRU Headform'!P17=\"D Green\"),\"Green\",'VRU Headform'!P17)))","v":0},{"$f":"IF(NOT('VRU Headform'!Q17=\"Blue\"),IF(OR('VRU Headform'!Q17=\"Red\",'VRU Headform'!Q17=\"D Red\"),\"Red\",IF(OR('VRU Headform'!Q17=\"Green\",'VRU Headform'!Q17=\"D Green\"),\"Green\",'VRU Headform'!Q17)))","v":0},{"$f":"IF(NOT('VRU Headform'!R17=\"Blue\"),IF(OR('VRU Headform'!R17=\"Red\",'VRU Headform'!R17=\"D Red\"),\"Red\",IF(OR('VRU Headform'!R17=\"Green\",'VRU Headform'!R17=\"D Green\"),\"Green\",'VRU Headform'!R17)))","v":0},{"$f":"IF(NOT('VRU Headform'!S17=\"Blue\"),IF(OR('VRU Headform'!S17=\"Red\",'VRU Headform'!S17=\"D Red\"),\"Red\",IF(OR('VRU Headform'!S17=\"Green\",'VRU Headform'!S17=\"D Green\"),\"Green\",'VRU Headform'!S17)))","v":0},{"$f":"IF(NOT('VRU Headform'!T17=\"Blue\"),IF(OR('VRU Headform'!T17=\"Red\",'VRU Headform'!T17=\"D Red\"),\"Red\",IF(OR('VRU Headform'!T17=\"Green\",'VRU Headform'!T17=\"D Green\"),\"Green\",'VRU Headform'!T17)))","v":0},{"$f":"IF(NOT('VRU Headform'!U17=\"Blue\"),IF(OR('VRU Headform'!U17=\"Red\",'VRU Headform'!U17=\"D Red\"),\"Red\",IF(OR('VRU Headform'!U17=\"Green\",'VRU Headform'!U17=\"D Green\"),\"Green\",'VRU Headform'!U17)))","v":0},{"$f":"IF(NOT('VRU Headform'!V17=\"Blue\"),IF(OR('VRU Headform'!V17=\"Red\",'VRU Headform'!V17=\"D Red\"),\"Red\",IF(OR('VRU Headform'!V17=\"Green\",'VRU Headform'!V17=\"D Green\"),\"Green\",'VRU Headform'!V17)))","v":0},{"$f":"IF(NOT('VRU Headform'!W17=\"Blue\"),IF(OR('VRU Headform'!W17=\"Red\",'VRU Headform'!W17=\"D Red\"),\"Red\",IF(OR('VRU Headform'!W17=\"Green\",'VRU Headform'!W17=\"D Green\"),\"Green\",'VRU Headform'!W17)))","v":0},{"$f":"IF(NOT('VRU Headform'!X17=\"Blue\"),IF(OR('VRU Headform'!X17=\"Red\",'VRU Headform'!X17=\"D Red\"),\"Red\",IF(OR('VRU Headform'!X17=\"Green\",'VRU Headform'!X17=\"D Green\"),\"Green\",'VRU Headform'!X17)))","v":0},{"$f":"IF(NOT('VRU Headform'!Y17=\"Blue\"),IF(OR('VRU Headform'!Y17=\"Red\",'VRU Headform'!Y17=\"D Red\"),\"Red\",IF(OR('VRU Headform'!Y17=\"Green\",'VRU Headform'!Y17=\"D Green\"),\"Green\",'VRU Headform'!Y17)))","v":0},"No"]
[null,null,1,{"$f":"IF(NOT('VRU Headform'!E18=\"Blue\"),IF(OR('VRU Headform'!E18=\"Red\",'VRU Headform'!E18=\"D Red\"),\"Red\",IF(OR('VRU Headform'!E18=\"Green\",'VRU Headform'!E18=\"D Green\"),\"Green\",'VRU Headform'!E18)))","v":0},{"$f":"IF(NOT('VRU Headform'!F18=\"Blue\"),IF(OR('VRU Headform'!F18=\"Red\",'VRU Headform'!F18=\"D Red\"),\"Red\",IF(OR('VRU Headform'!F18=\"Green\",'VRU Headform'!F18=\"D Green\"),\"Green\",'VRU Headform'!F18)))","v":0},{"$f":"IF(NOT('VRU Headform'!G18=\"Blue\"),IF(OR('VRU Headform'!G18=\"Red\",'VRU Headform'!G18=\"D Red\"),\"Red\",IF(OR('VRU Headform'!G18=\"Green\",'VRU Headform'!G18=\"D Green\"),\"Green\",'VRU Headform'!G18)))","v":0},{"$f":"IF(NOT('VRU Headform'!H18=\"Blue\"),IF(OR('VRU Headform'!H18=\"Red\",'VRU Headform'!H18=\"D Red\"),\"Red\",IF(OR('VRU Headform'!H18=\"Green\",'VRU Headform'!H18=\"D Green\"),\"Green\",'VRU Headform'!H18)))","v":0},{"$f":"IF(NOT('VRU Headform'!I18=\"Blue\"),IF(OR('VRU Headform'!I18=\"Red\",'VRU Headform'!I18=\"D Red\"),\"Red\",IF(OR('VRU Headform'!I18=\"Green\",'VRU Headform'!I18=\"D Green\"),\"Green\",'VRU Headform'!I18)))","v":0},{"$f":"IF(NOT('VRU Headform'!J18=\"Blue\"),IF(OR('VRU Headform'!J18=\"Red\",'VRU Headform'!J18=\"D Red\"),\"Red\",IF(OR('VRU Headform'!J18=\"Green\",'VRU Headform'!J18=\"D Green\"),\"Green\",'VRU Headform'!J18)))","v":0},{"$f":"IF(NOT('VRU Headform'!K18=\"Blue\"),IF(OR('VRU Headform'!K18=\"Red\",'VRU Headform'!K18=\"D Red\"),\"Red\",IF(OR('VRU Headform'!K18=\"Green\",'VRU Headform'!K18=\"D Green\"),\"Green\",'VRU Headform'!K18)))","v":0},{"$f":"IF(NOT('VRU Headform'!L18=\"Blue\"),IF(OR('VRU Headform'!L18=\"Red\",'VRU Headform'!L18=\"D Red\"),\"Red\",IF(OR('VRU Headform'!L18=\"Green\",'VRU Headform'!L18=\"D Green\"),\"Green\",'VRU Headform'!L18)))","v":0},{"$f":"IF(NOT('VRU Headform'!M18=\"Blue\"),IF(OR('VRU Headform'!M18=\"Red\",'VRU Headform'!M18=\"D Red\"),\"Red\",IF(OR('VRU Headform'!M18=\"Green\",'VRU Headform'!M18=\"D Green\"),\"Green\",'VRU Headform'!M18)))","v":0},{"$f":"IF(NOT('VRU Headform'!N18=\"Blue\"),IF(OR('VRU Headform'!N18=\"Red\",'VRU Headform'!N18=\"D Red\"),\"Red\",IF(OR('VRU Headform'!N18=\"Green\",'VRU Headform'!N18=\"D Green\"),\"Green\",'VRU Headform'!N18)))","v":0},{"$f":"IF(NOT('VRU Headform'!O18=\"Blue\"),IF(OR('VRU Headform'!O18=\"Red\",'VRU Headform'!O18=\"D Red\"),\"Red\",IF(OR('VRU Headform'!O18=\"Green\",'VRU Headform'!O18=\"D Green\"),\"Green\",'VRU Headform'!O18)))","v":0},{"$f":"IF(NOT('VRU Headform'!P18=\"Blue\"),IF(OR('VRU Headform'!P18=\"Red\",'VRU Headform'!P18=\"D Red\"),\"Red\",IF(OR('VRU Headform'!P18=\"Green\",'VRU Headform'!P18=\"D Green\"),\"Green\",'VRU Headform'!P18)))","v":0},{"$f":"IF(NOT('VRU Headform'!Q18=\"Blue\"),IF(OR('VRU Headform'!Q18=\"Red\",'VRU Headform'!Q18=\"D Red\"),\"Red\",IF(OR('VRU Headform'!Q18=\"Green\",'VRU Headform'!Q18=\"D Green\"),\"Green\",'VRU Headform'!Q18)))","v":0},{"$f":"IF(NOT('VRU Headform'!R18=\"Blue\"),IF(OR('VRU Headform'!R18=\"Red\",'VRU Headform'!R18=\"D Red\"),\"Red\",IF(OR('VRU Headform'!R18=\"Green\",'VRU Headform'!R18=\"D Green\"),\"Green\",'VRU Headform'!R18)))","v":0},{"$f":"IF(NOT('VRU Headform'!S18=\"Blue\"),IF(OR('VRU Headform'!S18=\"Red\",'VRU Headform'!S18=\"D Red\"),\"Red\",IF(OR('VRU Headform'!S18=\"Green\",'VRU Headform'!S18=\"D Green\"),\"Green\",'VRU Headform'!S18)))","v":0},{"$f":"IF(NOT('VRU Headform'!T18=\"Blue\"),IF(OR('VRU Headform'!T18=\"Red\",'VRU Headform'!T18=\"D Red\"),\"Red\",IF(OR('VRU Headform'!T18=\"Green\",'VRU Headform'!T18=\"D Green\"),\"Green\",'VRU Headform'!T18)))","v":0},{"$f":"IF(NOT('VRU Headform'!U18=\"Blue\"),IF(OR('VRU Headform'!U18=\"Red\",'VRU Headform'!U18=\"D Red\"),\"Red\",IF(OR('VRU Headform'!U18=\"Green\",'VRU Headform'!U18=\"D Green\"),\"Green\",'VRU Headform'!U18)))","v":0},{"$f":"IF(NOT('VRU Headform'!V18=\"Blue\"),IF(OR('VRU Headform'!V18=\"Red\",'VRU Headform'!V18=\"D Red\"),\"Red\",IF(OR('VRU Headform'!V18=\"Green\",'VRU Headform'!V18=\"D Green\"),\"Green\",'VRU Headform'!V18)))","v":0},{"$f":"IF(NOT('VRU Headform'!W18=\"Blue\"),IF(OR('VRU Headform'!W18=\"Red\",'VRU Headform'!W18=\"D Red\"),\"Red\",IF(OR('VRU Headform'!W18=\"Green\",'VRU Headform'!W18=\"D Green\"),\"Green\",'VRU Headform'!W18)))","v":0},{"$f":"IF(NOT('VRU Headform'!X18=\"Blue\"),IF(OR('VRU Headform'!X18=\"Red\",'VRU Headform'!X18=\"D Red\"),\"Red\",IF(OR('VRU Headform'!X18=\"Green\",'VRU Headform'!X18=\"D Green\"),\"Green\",'VRU Headform'!X18)))","v":0},{"$f":"IF(NOT('VRU Headform'!Y18=\"Blue\"),IF(OR('VRU Headform'!Y18=\"Red\",'VRU Headform'!Y18=\"D Red\"),\"Red\",IF(OR('VRU Headform'!Y18=\"Green\",'VRU Headform'!Y18=\"D Green\"),\"Green\",'VRU Headform'!Y18)))","v":0},"No"]
[null,null,0,{"$f":"IF(NOT('VRU Headform'!E19=\"Blue\"),IF(OR('VRU Headform'!E19=\"Red\",'VRU Headform'!E19=\"D Red\"),\"Red\",IF(OR('VRU Headform'!E19=\"Green\",'VRU Headform'!E19=\"D Green\"),\"Green\",'VRU Headform'!E19)))","v":0},{"$f":"IF(NOT('VRU Headform'!F19=\"Blue\"),IF(OR('VRU Headform'!F19=\"Red\",'VRU Headform'!F19=\"D Red\"),\"Red\",IF(OR('VRU Headform'!F19=\"Green\",'VRU Headform'!F19=\"D Green\"),\"Green\",'VRU Headform'!F19)))","v":0},{"$f":"IF(NOT('VRU Headform'!G19=\"Blue\"),IF(OR('VRU Headform'!G19=\"Red\",'VRU Headform'!G19=\"D Red\"),\"Red\",IF(OR('VRU Headform'!G19=\"Green\",'VRU Headform'!G19=\"D Green\"),\"Green\",'VRU Headform'!G19)))","v":0},{"$f":"IF(NOT('VRU Headform'!H19=\"Blue\"),IF(OR('VRU Headform'!H19=\"Red\",'VRU Headform'!H19=\"D Red\"),\"Red\",IF(OR('VRU Headform'!H19=\"Green\",'VRU Headform'!H19=\"D Green\"),\"Green\",'VRU Headform'!H19)))","v":0},{"$f":"IF(NOT('VRU Headform'!I19=\"Blue\"),IF(OR('VRU Headform'!I19=\"Red\",'VRU Headform'!I19=\"D Red\"),\"Red\",IF(OR('VRU Headform'!I19=\"Green\",'VRU Headform'!I19=\"D Green\"),\"Green\",'VRU Headform'!I19)))","v":0},{"$f":"IF(NOT('VRU Headform'!J19=\"Blue\"),IF(OR('VRU Headform'!J19=\"Red\",'VRU Headform'!J19=\"D Red\"),\"Red\",IF(OR('VRU Headform'!J19=\"Green\",'VRU Headform'!J19=\"D Green\"),\"Green\",'VRU Headform'!J19)))","v":0},{"$f":"IF(NOT('VRU Headform'!K19=\"Blue\"),IF(OR('VRU Headform'!K19=\"Red\",'VRU Headform'!K19=\"D Red\"),\"Red\",IF(OR('VRU Headform'!K19=\"Green\",'VRU Headform'!K19=\"D Green\"),\"Green\",'VRU Headform'!K19)))","v":0},{"$f":"IF(NOT('VRU Headform'!L19=\"Blue\"),IF(OR('VRU Headform'!L19=\"Red\",'VRU Headform'!L19=\"D Red\"),\"Red\",IF(OR('VRU Headform'!L19=\"Green\",'VRU Headform'!L19=\"D Green\"),\"Green\",'VRU Headform'!L19)))","v":0},{"$f":"IF(NOT('VRU Headform'!M19=\"Blue\"),IF(OR('VRU Headform'!M19=\"Red\",'VRU Headform'!M19=\"D Red\"),\"Red\",IF(OR('VRU Headform'!M19=\"Green\",'VRU Headform'!M19=\"D Green\"),\"Green\",'VRU Headform'!M19)))","v":0},{"$f":"IF(NOT('VRU Headform'!N19=\"Blue\"),IF(OR('VRU Headform'!N19=\"Red\",'VRU Headform'!N19=\"D Red\"),\"Red\",IF(OR('VRU Headform'!N19=\"Green\",'VRU Headform'!N19=\"D Green\"),\"Green\",'VRU Headform'!N19)))","v":0},{"$f":"IF(NOT('VRU Headform'!O19=\"Blue\"),IF(OR('VRU Headform'!O19=\"Red\",'VRU Headform'!O19=\"D Red\"),\"Red\",IF(OR('VRU Headform'!O19=\"Green\",'VRU Headform'!O19=\"D Green\"),\"Green\",'VRU Headform'!O19)))","v":0},{"$f":"IF(NOT('VRU Headform'!P19=\"Blue\"),IF(OR('VRU Headform'!P19=\"Red\",'VRU Headform'!P19=\"D Red\"),\"Red\",IF(OR('VRU Headform'!P19=\"Green\",'VRU Headform'!P19=\"D Green\"),\"Green\",'VRU Headform'!P19)))","v":0},{"$f":"IF(NOT('VRU Headform'!Q19=\"Blue\"),IF(OR('VRU Headform'!Q19=\"Red\",'VRU Headform'!Q19=\"D Red\"),\"Red\",IF(OR('VRU Headform'!Q19=\"Green\",'VRU Headform'!Q19=\"D Green\"),\"Green\",'VRU Headform'!Q19)))","v":0},{"$f":"IF(NOT('VRU Headform'!R19=\"Blue\"),IF(OR('VRU Headform'!R19=\"Red\",'VRU Headform'!R19=\"D Red\"),\"Red\",IF(OR('VRU Headform'!R19=\"Green\",'VRU Headform'!R19=\"D Green\"),\"Green\",'VRU Headform'!R19)))","v":0},{"$f":"IF(NOT('VRU Headform'!S19=\"Blue\"),IF(OR('VRU Headform'!S19=\"Red\",'VRU Headform'!S19=\"D Red\"),\"Red\",IF(OR('VRU Headform'!S19=\"Green\",'VRU Headform'!S19=\"D Green\"),\"Green\",'VRU Headform'!S19)))","v":0},{"$f":"IF(NOT('VRU Headform'!T19=\"Blue\"),IF(OR('VRU Headform'!T19=\"Red\",'VRU Headform'!T19=\"D Red\"),\"Red\",IF(OR('VRU Headform'!T19=\"Green\",'VRU Headform'!T19=\"D Green\"),\"Green\",'VRU Headform'!T19)))","v":0},{"$f":"IF(NOT('VRU Headform'!U19=\"Blue\"),IF(OR('VRU Headform'!U19=\"Red\",'VRU Headform'!U19=\"D Red\"),\"Red\",IF(OR('VRU Headform'!U19=\"Green\",'VRU Headform'!U19=\"D Green\"),\"Green\",'VRU Headform'!U19)))","v":0},{"$f":"IF(NOT('VRU Headform'!V19=\"Blue\"),IF(OR('VRU Headform'!V19=\"Red\",'VRU Headform'!V19=\"D Red\"),\"Red\",IF(OR('VRU Headform'!V19=\"Green\",'VRU Headform'!V19=\"D Green\"),\"Green\",'VRU Headform'!V19)))","v":0},{"$f":"IF(NOT('VRU Headform'!W19=\"Blue\"),IF(OR('VRU Headform'!W19=\"Red\",'VRU Headform'!W19=\"D Red\"),\"Red\",IF(OR('VRU Headform'!W19=\"Green\",'VRU Headform'!W19=\"D Green\"),\"Green\",'VRU Headform'!W19)))","v":0},{"$f":"IF(NOT('VRU Headform'!X19=\"Blue\"),IF(OR('VRU Headform'!X19=\"Red\",'VRU Headform'!X19=\"D Red\"),\"Red\",IF(OR('VRU Headform'!X19=\"Green\",'VRU Headform'!X19=\"D Green\"),\"Green\",'VRU Headform'!X19)))","v":0},{"$f":"IF(NOT('VRU Headform'!Y19=\"Blue\"),IF(OR('VRU Headform'!Y19=\"Red\",'VRU Headform'!Y19=\"D Red\"),\"Red\",IF(OR('VRU Headform'!Y19=\"Green\",'VRU Headform'!Y19=\"D Green\"),\"Green\",'VRU Headform'!Y19)))","v":0},{"$f":"IF(C159=$C$143,\"Yes\",\"No\")","v":"No"}]
[null,"rounded total",{"$f":"ROUND('VRU Headform'!T68,1)","v":0}]
[null,"Max points",24]
[]
[null,"VRU UPPER LEGFORM"]
[null,"U +10",{"$f":"IF('VRU Upper Legform'!D8=\"N/A\",\"\",IF('VRU Upper Legform'!AA8=1,\"Green\",IF('VRU Upper Legform'!AA8>0.75,\"Yellow\",IF('VRU Upper Legform'!AA8>0.5,\"Orange\",IF('VRU Upper Legform'!AA8>0.25,\"Brown\",\"Red\")))))","v":"Yellow"}]
[null,"U +9",{"$f":"IF('VRU Upper Legform'!D9=\"N/A\",\"\",IF('VRU Upper Legform'!AA9=1,\"Green\",IF('VRU Upper Legform'!AA9>0.75,\"Yellow\",IF('VRU Upper Legform'!AA9>0.5,\"Orange\",IF('VRU Upper Legform'!AA9>0.25,\"Brown\",\"Red\")))))","v":"Yellow"}]
[null,"U +8",{"$f":"IF('VRU Upper Legform'!D10=\"N/A\",\"\",IF('VRU Upper Legform'!AA10=1,\"Green\",IF('VRU Upper Legform'!AA10>0.75,\"Yellow\",IF('VRU Upper Legform'!AA10>0.5,\"Orange\",IF('VRU Upper Legform'!AA10>0.25,\"Brown\",\"Red\")))))","v":"Yellow"}]
[null,"U +7",{"$f":"IF('VRU Upper Legform'!D11=\"N/A\",\"\",IF('VRU Upper Legform'!AA11=1,\"Green\",IF('VRU Upper Legform'!AA11>0.75,\"Yellow\",IF('VRU Upper Legform'!AA11>0.5,\"Orange\",IF('VRU Upper Legform'!AA11>0.25,\"Brown\",\"Red\")))))","v":"Yellow"}]
[null,"U +6",{"$f":"IF('VRU Upper Legform'!D12=\"N/A\",\"\",IF('VRU Upper Legform'!AA12=1,\"Green\",IF('VRU Upper Legform'!AA12>0.75,\"Yellow\",IF('VRU Upper Legform'!AA12>0.5,\"Orange\",IF('VRU Upper Legform'!AA12>0.25,\"Brown\",\"Red\")))))","v":"Yellow"}]
[null,"U +5",{"$f":"IF('VRU Upper Legform'!D13=\"N/A\",\"\",IF('VRU Upper Legform'!AA13=1,\"Green\",IF('VRU Upper Legform'!AA13>0.75,\"Yellow\",IF('VRU Upper Legform'!AA13>0.5,\"Orange\",IF('VRU Upper Legform'!AA13>0.25,\"Brown\",\"Red\")))))","v":"Yellow"}]
[null,"U +4",{"$f":"IF('VRU Upper Legform'!D14=\"N/A\",\"\",IF('VRU Upper Legform'!AA14=1,\"Green\",IF('VRU Upper Legform'!AA14>0.75,\"Yellow\",IF('VRU Upper Legform'!AA14>0.5,\"Orange\",IF('VRU Upper Legform'!AA14>0.25,\"Brown\",\"Red\")))))","v":"Yellow"}]
[null,"U +3",{"$f":"IF('VRU Upper Legform'!D15=\"N/A\",\"\",IF('VRU Upper Legform'!AA15=1,\"Green\",IF('VRU Upper Legform'!AA15>0.75,\"Yellow\",IF('VRU Upper Legform'!AA15>0.5,\"Orange\",IF('VRU Upper Legform'!AA15>0.25,\"Brown\",\"Red\")))))","v":"Yellow"}]
[null,"U +2",{"$f":"IF('VRU Upper Legform'!D16=\"N/A\",\"\",IF('VRU Upper Legform'!AA16=1,\"Green\",IF('VRU Upper Legform'!AA16>0.75,\"Yellow\",IF('VRU Upper Legform'!AA16>0.5,\"Orange\",IF('VRU Upper Legform'!AA16>0.25,\"Brown\",\"Red\")))))","v":"Yellow"}]
[null,"U +1",{"$f":"IF('VRU Upper Legform'!D17=\"N/A\",\"\",IF('VRU Upper Legform'!AA17=1,\"Green\",IF('VRU Upper Legform'!AA17>0.75,\"Yellow\",IF('VRU Upper Legform'!AA17>0.5,\"Orange\",IF('VRU Upper Legform'!AA17>0.25,\"Brown\",\"Red\")))))","v":"Yellow"}]
[null,"U 0",{"$f":"IF('VRU Upper Legform'!D18=\"N/A\",\"\",IF('VRU Upper Legform'!AA18=1,\"Green\",IF('VRU Upper Legform'!AA18>0.75,\"Yellow\",IF('VRU Upper Legform'!AA18>0.5,\"Orange\",IF('VRU Upper Legform'!AA18>0.25,\"Brown\",\"Red\")))))","v":"Yellow"}]
[null,"U -1",{"$f":"IF('VRU Upper Legform'!D19=\"N/A\",\"\",IF('VRU Upper Legform'!AA19=1,\"Green\",IF('VRU Upper Legform'!AA19>0.75,\"Yellow\",IF('VRU Upper Legform'!AA19>0.5,\"Orange\",IF('VRU Upper Legform'!AA19>0.25,\"Brown\",\"Red\")))))","v":"Yellow"}]
[null,"U -2",{"$f":"IF('VRU Upper Legform'!D20=\"N/A\",\"\",IF('VRU Upper Legform'!AA20=1,\"Green\",IF('VRU Upper Legform'!AA20>0.75,\"Yellow\",IF('VRU Upper Legform'!AA20>0.5,\"Orange\",IF('VRU Upper Legform'!AA20>0.25,\"Brown\",\"Red\")))))","v":"Yellow"}]
[null,"U -3",{"$f":"IF('VRU Upper Legform'!D21=\"N/A\",\"\",IF('VRU Upper Legform'!AA21=1,\"Green\",IF('VRU Upper Legform'!AA21>0.75,\"Yellow\",IF('VRU Upper Legform'!AA21>0.5,\"Orange\",IF('VRU Upper Legform'!AA21>0.25,\"Brown\",\"Red\")))))","v":"Yellow"}]
[null,"U -4",{"$f":"IF('VRU Upper Legform'!D22=\"N/A\",\"\",IF('VRU Upper Legform'!AA22=1,\"Green\",IF('VRU Upper Legform'!AA22>0.75,\"Yellow\",IF('VRU Upper Legform'!AA22>0.5,\"Orange\",IF('VRU Upper Legform'!AA22>0.25,\"Brown\",\"Red\")))))","v":"Yellow"}]
[null,"U -5",{"$f":"IF('VRU Upper Legform'!D23=\"N/A\",\"\",IF('VRU Upper Legform'!AA23=1,\"Green\",IF('VRU Upper Legform'!AA23>0.75,\"Yellow\",IF('VRU Upper Legform'!AA23>0.5,\"Orange\",IF('VRU Upper Legform'!AA23>0.25,\"Brown\",\"Red\")))))","v":"Yellow"}]
[null,"U -6",{"$f":"IF('VRU Upper Legform'!D24=\"N/A\",\"\",IF('VRU Upper Legform'!AA24=1,\"Green\",IF('VRU Upper Legform'!AA24>0.75,\"Yellow\",IF('VRU Upper Legform'!AA24>0.5,\"Orange\",IF('VRU Upper Legform'!AA24>0.25,\"Brown\",\"Red\")))))","v":"Yellow"}]
[null,"U -7",{"$f":"IF('VRU Upper Legform'!D25=\"N/A\",\"\",IF('VRU Upper Legform'!AA25=1,\"Green\",IF('VRU Upper Legform'!AA25>0.75,\"Yellow\",IF('VRU Upper Legform'!AA25>0.5,\"Orange\",IF('VRU Upper Legform'!AA25>0.25,\"Brown\",\"Red\")))))","v":"Yellow"}]
[null,"U -8",{"$f":"IF('VRU Upper Legform'!D26=\"N/A\",\"\",IF('VRU Upper Legform'!AA26=1,\"Green\",IF('VRU Upper Legform'!AA26>0.75,\"Yellow\",IF('VRU Upper Legform'!AA26>0.5,\"Orange\",IF('VRU Upper Legform'!AA26>0.25,\"Brown\",\"Red\")))))","v":"Yellow"}]
[null,"U -9",{"$f":"IF('VRU Upper Legform'!D27=\"N/A\",\"\",IF('VRU Upper Legform'!AA27=1,\"Green\",IF('VRU Upper Legform'!AA27>0.75,\"Yellow\",IF('VRU Upper Legform'!AA27>0.5,\"Orange\",IF('VRU Upper Legform'!AA27>0.25,\"Brown\",\"Red\")))))","v":"Yellow"}]
[null,"U -10",{"$f":"IF('VRU Upper Legform'!D28=\"N/A\",\"\",IF('VRU Upper Legform'!AA28=1,\"Green\",IF('VRU Upper Legform'!AA28>0.75,\"Yellow\",IF('VRU Upper Legform'!AA28>0.5,\"Orange\",IF('VRU Upper Legform'!AA28>0.25,\"Brown\",\"Red\")))))","v":"Yellow"}]
[null,"ROUNDED TOTAL",{"$f":"ROUND('VRU Upper Legform'!G35,1)","v":0}]
[null,"MAX POINTS",6]
[]
[null,"VRU LOWER LEGFORM"]
[null,"L +10",{"$f":"IF('VRU Lower Legform'!$D8=\"N/A\",\"\",IF('VRU Lower Legform'!W8=1,\"Green\",IF('VRU Lower Legform'!W8>0.75,\"Yellow\",IF('VRU Lower Legform'!W8>0.5,\"Orange\",IF('VRU Lower Legform'!W8>0.25,\"Brown\",\"Red\")))))","v":"Yellow"}]
[null,"L +9",{"$f":"IF('VRU Lower Legform'!$D9=\"N/A\",\"\",IF('VRU Lower Legform'!W9=1,\"Green\",IF('VRU Lower Legform'!W9>0.75,\"Yellow\",IF('VRU Lower Legform'!W9>0.5,\"Orange\",IF('VRU Lower Legform'!W9>0.25,\"Brown\",\"Red\")))))","v":"Yellow"}]
[null,"L +8",{"$f":"IF('VRU Lower Legform'!$D10=\"N/A\",\"\",IF('VRU Lower Legform'!W10=1,\"Green\",IF('VRU Lower Legform'!W10>0.75,\"Yellow\",IF('VRU Lower Legform'!W10>0.5,\"Orange\",IF('VRU Lower Legform'!W10>0.25,\"Brown\",\"Red\")))))","v":"Yellow"}]
[null,"L +7",{"$f":"IF('VRU Lower Legform'!$D11=\"N/A\",\"\",IF('VRU Lower Legform'!W11=1,\"Green\",IF('VRU Lower Legform'!W11>0.75,\"Yellow\",IF('VRU Lower Legform'!W11>0.5,\"Orange\",IF('VRU Lower Legform'!W11>0.25,\"Brown\",\"Red\")))))","v":"Yellow"}]
[null,"L +6",{"$f":"IF('VRU Lower Legform'!$D12=\"N/A\",\"\",IF('VRU Lower Legform'!W12=1,\"Green\",IF('VRU Lower Legform'!W12>0.75,\"Yellow\",IF('VRU Lower Legform'!W12>0.5,\"Orange\",IF('VRU Lower Legform'!W12>0.25,\"Brown\",\"Red\")))))","v":"Yellow"}]
[null,"L +5",{"$f":"IF('VRU Lower Legform'!$D13=\"N/A\",\"\",IF('VRU Lower Legform'!W13=1,\"Green\",IF('VRU Lower Legform'!W13>0.75,\"Yellow\",IF('VRU Lower Legform'!W13>0.5,\"Orange\",IF('VRU Lower Legform'!W13>0.25,\"Brown\",\"Red\")))))","v":"Yellow"}]
[null,"L +4",{"$f":"IF('VRU Lower Legform'!$D14=\"N/A\",\"\",IF('VRU Lower Legform'!W14=1,\"Green\",IF('VRU Lower Legform'!W14>0.75,\"Yellow\",IF('VRU Lower Legform'!W14>0.5,\"Orange\",IF('VRU Lower Legform'!W14>0.25,\"Brown\",\"Red\")))))","v":"Yellow"}]
[null,"L +3",{"$f":"IF('VRU Lower Legform'!$D15=\"N/A\",\"\",IF('VRU Lower Legform'!W15=1,\"Green\",IF('VRU Lower Legform'!W15>0.75,\"Yellow\",IF('VRU Lower Legform'!W15>0.5,\"Orange\",IF('VRU Lower Legform'!W15>0.25,\"Brown\",\"Red\")))))","v":"Yellow"}]
[null,"L +2",{"$f":"IF('VRU Lower Legform'!$D16=\"N/A\",\"\",IF('VRU Lower Legform'!W16=1,\"Green\",IF('VRU Lower Legform'!W16>0.75,\"Yellow\",IF('VRU Lower Legform'!W16>0.5,\"Orange\",IF('VRU Lower Legform'!W16>0.25,\"Brown\",\"Red\")))))","v":"Yellow"}]
[null,"L +1",{"$f":"IF('VRU Lower Legform'!$D17=\"N/A\",\"\",IF('VRU Lower Legform'!W17=1,\"Green\",IF('VRU Lower Legform'!W17>0.75,\"Yellow\",IF('VRU Lower Legform'!W17>0.5,\"Orange\",IF('VRU Lower Legform'!W17>0.25,\"Brown\",\"Red\")))))","v":"Yellow"}]
[null,"L 0",{"$f":"IF('VRU Lower Legform'!$D18=\"N/A\",\"\",IF('VRU Lower Legform'!W18=1,\"Green\",IF('VRU Lower Legform'!W18>0.75,\"Yellow\",IF('VRU Lower Legform'!W18>0.5,\"Orange\",IF('VRU Lower Legform'!W18>0.25,\"Brown\",\"Red\")))))","v":"Yellow"}]
[null,"L -1",{"$f":"IF('VRU Lower Legform'!$D19=\"N/A\",\"\",IF('VRU Lower Legform'!W19=1,\"Green\",IF('VRU Lower Legform'!W19>0.75,\"Yellow\",IF('VRU Lower Legform'!W19>0.5,\"Orange\",IF('VRU Lower Legform'!W19>0.25,\"Brown\",\"Red\")))))","v":"Yellow"}]
[null,"L -2",{"$f":"IF('VRU Lower Legform'!$D20=\"N/A\",\"\",IF('VRU Lower Legform'!W20=1,\"Green\",IF('VRU Lower Legform'!W20>0.75,\"Yellow\",IF('VRU Lower Legform'!W20>0.5,\"Orange\",IF('VRU Lower Legform'!W20>0.25,\"Brown\",\"Red\")))))","v":"Yellow"}]
[null,"L -3",{"$f":"IF('VRU Lower Legform'!$D21=\"N/A\",\"\",IF('VRU Lower Legform'!W21=1,\"Green\",IF('VRU Lower Legform'!W21>0.75,\"Yellow\",IF('VRU Lower Legform'!W21>0.5,\"Orange\",IF('VRU Lower Legform'!W21>0.25,\"Brown\",\"Red\")))))","v":"Yellow"}]
[null,"L -4",{"$f":"IF('VRU Lower Legform'!$D22=\"N/A\",\"\",IF('VRU Lower Legform'!W22=1,\"Green\",IF('VRU Lower Legform'!W22>0.75,\"Yellow\",IF('VRU Lower Legform'!W22>0.5,\"Orange\",IF('VRU Lower Legform'!W22>0.25,\"Brown\",\"Red\")))))","v":"Yellow"}]
[null,"L -5",{"$f":"IF('VRU Lower Legform'!$D23=\"N/A\",\"\",IF('VRU Lower Legform'!W23=1,\"Green\",IF('VRU Lower Legform'!W23>0.75,\"Yellow\",IF('VRU Lower Legform'!W23>0.5,\"Orange\",IF('VRU Lower Legform'!W23>0.25,\"Brown\",\"Red\")))))","v":"Yellow"}]
[null,"L -6",{"$f":"IF('VRU Lower Legform'!$D24=\"N/A\",\"\",IF('VRU Lower Legform'!W24=1,\"Green\",IF('VRU Lower Legform'!W24>0.75,\"Yellow\",IF('VRU Lower Legform'!W24>0.5,\"Orange\",IF('VRU Lower Legform'!W24>0.25,\"Brown\",\"Red\")))))","v":"Yellow"}]
[null,"L -7",{"$f":"IF('VRU Lower Legform'!$D25=\"N/A\",\"\",IF('VRU Lower Legform'!W25=1,\"Green\",IF('VRU Lower Legform'!W25>0.75,\"Yellow\",IF('VRU Lower Legform'!W25>0.5,\"Orange\",IF('VRU Lower Legform'!W25>0.25,\"Brown\",\"Red\")))))","v":"Yellow"}]
[null,"L -8",{"$f":"IF('VRU Lower Legform'!$D26=\"N/A\",\"\",IF('VRU Lower Legform'!W26=1,\"Green\",IF('VRU Lower Legform'!W26>0.75,\"Yellow\",IF('VRU Lower Legform'!W26>0.5,\"Orange\",IF('VRU Lower Legform'!W26>0.25,\"Brown\",\"Red\")))))","v":"Yellow"}]
[null,"L -9",{"$f":"IF('VRU Lower Legform'!$D27=\"N/A\",\"\",IF('VRU Lower Legform'!W27=1,\"Green\",IF('VRU Lower Legform'!W27>0.75,\"Yellow\",IF('VRU Lower Legform'!W27>0.5,\"Orange\",IF('VRU Lower Legform'!W27>0.25,\"Brown\",\"Red\")))))","v":"Yellow"}]
[null,"L -10",{"$f":"IF('VRU Lower Legform'!$D28=\"N/A\",\"\",IF('VRU Lower Legform'!W28=1,\"Green\",IF('VRU Lower Legform'!W28>0.75,\"Yellow\",IF('VRU Lower Legform'!W28>0.5,\"Orange\",IF('VRU Lower Legform'!W28>0.25,\"Brown\",\"Red\")))))","v":"Yellow"}]
[null,"ROUNDED TOTAL",{"$f":"ROUND('VRU Lower Legform'!E35,1)","v":0}]
[null,"MAX POINTS",6]
[]
[null,"VRU AEB"]
[null,"rounded_total",{"$f":"ROUND('VRU AEB Pedestrian'!D126+'VRU AEB Cyclist'!D86,1)","v":0}]
[]
[null,null,"Day","Night"]
[null,"rounded total",{"$f":"ROUND('VRU AEB Pedestrian'!D126,1)","v":0}]
[null,"Max points",9]
[null,null,{"$f":"'VRU AEB Pedestrian'!D126/C218","v":0}]
[null,"VRU-AEB-Ped-COLOUR",{"$f":"IF(OR('General Overview'!E54=\"Not available\",'General Overview'!E54=\"Optional not meeting fitment\"),\"\",IF(C219=0,\"RED\",IF(C219<=0.25,\"BROWN\",IF(C219<=0.5,\"ORANGE\",IF(C219<0.75,\"YELLOW\",\"GREEN\")))))","v":"RED"}]
[null,"rounded_dayt, rounded nighttime",{"$f":"ROUND('VRU AEB Pedestrian'!D123,1)","v":0},{"$f":"ROUND('VRU AEB Pedestrian'!D124,1)","v":0}]
[null,"CPFA-50 rounded",{"$f":"ROUND('VRU AEB Pedestrian'!D30,1)","v":0}]
[null,"CPFA_50-colour"]
[null,"CPFA_50-summary percentage"]
[null,"CPNA_25 rounded",{"$f":"ROUND('VRU AEB Pedestrian'!D44,1)","v":0},{"$f":"ROUND('VRU AEB Pedestrian'!F44,1)","v":0}]
[null,"CPNA_25-colour"]
[null,"CPNA_25-summary percentage"]
[null,"CPNA_75 rounded",{"$f":"ROUND('VRU AEB Pedestrian'!D58,1)","v":0},{"$f":"ROUND('VRU AEB Pedestrian'!F58,1)","v":0}]
[null,"CPNA_75-colour"]
[null,"CPNA_75-summary percentage"]
[null,"CPNC_50 rounded",{"$f":"ROUND('VRU AEB Pedestrian'!D72,1)","v":0}]
[null,"CPNC_50-colour"]
[null,"CPNC_50-summary percentage"]
[null,"CPTA_50 rounded",{"$f":"ROUND('VRU AEB Pedestrian'!D78,1)","v":0}]
[null,"CPTA_50-colour",{"$f":"C254","v":"Red"}]
[null,"CPTA_50-summary percentage"]
[null,"CPRA rounded",{"$f":"ROUND('VRU AEB Pedestrian'!D89,1)","v":0}]
[null,"CPRA-colour",{"$f":"C256","v":"Red"}]
[null,"CPRA-summary percentage"]
[null,"CPLA_50 rounded",{"$f":"ROUND('VRU AEB Pedestrian'!D101,1)","v":0},{"$f":"ROUND('VRU AEB Pedestrian'!F101,1)","v":0}]
[null,"CPLA_50-colour"]
[null,"CPLA_50-summary percentage"]
[null,"CPLA_25 rounded",{"$f":"ROUND('VRU AEB Pedestrian'!D111,1)","v":0},{"$f":"ROUND('VRU AEB Pedestrian'!F111,1)","v":0}]
[null,"CPLA_25-colour"]
[null,"CPLA_25-summary percentage"]
[null,"AEB PEDESTRIAN"]
[null,"Adult_Crossing Road",{"$f":"SUM('VRU AEB Pedestrian'!D30,'VRU AEB Pedestrian'!D44,'VRU AEB Pedestrian'!D58)/SUM('VRU AEB Pedestrian'!B19:B29,'VRU AEB Pedestrian'!B33:B43,'VRU AEB Pedestrian'!B47:B57)","v":0},{"$f":"SUM('VRU AEB Pedestrian'!F44,'VRU AEB Pedestrian'!F58)/SUM('VRU AEB Pedestrian'!B33:B43,'VRU AEB Pedestrian'!B47:B57)","v":0}]
[null,"Adult_Crossing Road_Colour",{"$f":"IF(OR('General Overview'!$E$54=\"Not available\",'General Overview'!$E$54=\"Optional not meeting fitment\"),\"\",IF((C247)>=0.75,\"Green\",IF((C247)>=0.5,\"Yellow\",IF((C247)>=0.25,\"Orange\",IF((C247)>0,\"Brown\",\"Red\")))))","v":"Red"},{"$f":"IF(OR('General Overview'!$E$54=\"Not available\",'General Overview'!$E$54=\"Optional not meeting fitment\"),\"\",IF((D247)>=0.75,\"Green\",IF((D247)>=0.5,\"Yellow\",IF((D247)>=0.25,\"Orange\",IF((D247)>0,\"Brown\",\"Red\")))))","v":"Red"}]
[null,"Child Running",{"$f":"'VRU AEB Pedestrian'!D72/SUM('VRU AEB Pedestrian'!B61:B71)","v":0}]
[null,"Child Running_Colour",{"$f":"IF(OR('General Overview'!$E$54=\"Not available\",'General Overview'!$E$54=\"Optional not meeting fitment\"),\"\",IF((C249)>=0.75,\"Green\",IF((C249)>=0.5,\"Yellow\",IF((C249)>=0.25,\"Orange\",IF((C249)>0,\"Brown\",\"Red\")))))","v":"Red"}]
[null,"Adult Along Road",{"$f":"SUM('VRU AEB Pedestrian'!D101,'VRU AEB Pedestrian'!D111)/SUM('VRU AEB Pedestrian'!B92:B100,'VRU AEB Pedestrian'!B104:B110)","v":0},{"$f":"SUM('VRU AEB Pedestrian'!F101,'VRU AEB Pedestrian'!F111)/SUM('VRU AEB Pedestrian'!B92:B100,'VRU AEB Pedestrian'!B104:B110)","v":0}]
[null,"Adult Along Road_Colour",{"$f":"IF(OR('General Overview'!$E$54=\"Not available\",'General Overview'!$E$54=\"Optional not meeting fitment\"),\"\",IF((C251)>=0.75,\"Green\",IF((C251)>=0.5,\"Yellow\",IF((C251)>=0.25,\"Orange\",IF((C251)>0,\"Brown\",\"Red\")))))","v":"Red"},{"$f":"IF(OR('General Overview'!$E$54=\"Not available\",'General Overview'!$E$54=\"Optional not meeting fitment\"),\"\",IF((D251)>=0.75,\"Green\",IF((D251)>=0.5,\"Yellow\",IF((D251)>=0.25,\"Orange\",IF((D251)>0,\"Brown\",\"Red\")))))","v":"Red"}]
[null,"Turn Across",{"$f":"'VRU AEB Pedestrian'!D78/SUM('VRU AEB Pedestrian'!B75:B77)","v":0}]
[null,"Turn Across_Colour",{"$f":"IF(OR('General Overview'!$E$54=\"Not available\",'General Overview'!$E$54=\"Optional not meeting fitment\"),\"\",IF((C253)>=0.75,\"Green\",IF((C253)>=0.5,\"Yellow\",IF((C253)>=0.25,\"Orange\",IF((C253)>0,\"Brown\",\"Red\")))))","v":"Red"}]
[null,"Reverse",{"$f":"'VRU AEB Pedestrian'!D89/SUM('VRU AEB Pedestrian'!B81:B88)","v":0}]
[null,"Reverse_Colour",{"$f":"IF(OR('General Overview'!$E$54=\"Not available\",'General Overview'!$E$54=\"Optional not meeting fitment\"),\"\",IF((C255/1.8)>=0.75,\"Green\",IF((C255/1.8)>=0.5,\"Yellow\",IF((C255/1.8)>=0.25,\"Orange\",IF((C255/1.8)>0,\"Brown\",\"Red\")))))","v":"Red"}]
[null,"AEB CYCLIST"]
[null,"Cyclist Crossing",{"$f":"SUM('VRU AEB Cyclist'!D57,'VRU AEB Cyclist'!D43,'VRU AEB Cyclist'!D29)/33","v":0}]
[null,"Cyclist Crossing_Colour",{"$f":"IF(OR('General Overview'!$E$55=\"Not available\",'General Overview'!$E$55=\"Optional not meeting fitment\"),\"\",IF((C258)>=0.75,\"Green\",IF((C258)>=0.5,\"Yellow\",IF((C258)>=0.25,\"Orange\",IF((C258)>0,\"Brown\",\"Red\")))))","v":"Red"}]
[null,"Cyclist along road",{"$f":"SUM('VRU AEB Cyclist'!D78,'VRU AEB Cyclist'!D68)/SUM('VRU AEB Cyclist'!B60:B67,'VRU AEB Cyclist'!B71:B77)","v":0}]
[null,"Cyclist along road_colour",{"$f":"IF(OR('General Overview'!$E$55=\"Not available\",'General Overview'!$E$55=\"Optional not meeting fitment\"),\"\",IF((C260)>=0.75,\"Green\",IF((C260)>=0.5,\"Yellow\",IF((C260)>=0.25,\"Orange\",IF((C260)>0,\"Brown\",\"Red\")))))","v":"Red"}]
[null,"CBFA - rounded",{"$f":"ROUND('VRU AEB Cyclist'!D29,1)","v":0}]
[null,"CBNA - rounded",{"$f":"ROUND('VRU AEB Cyclist'!D43,1)","v":0},{"$f":"'VRU AEB Cyclist'!D57/11","v":0}]
[null,"CBNAO - colour",{"$f":"IF(OR('General Overview'!$E$55=\"Not available\",'General Overview'!$E$55=\"Optional not meeting fitment\"),\"\",IF((D263)>=0.75,\"Green\",IF((D263)>=0.5,\"Yellow\",IF((D263)>=0.25,\"Orange\",IF((D263)>0,\"Brown\",\"Red\")))))","v":"Red"}]
[null,"CBNAO - rounded",{"$f":"ROUND('VRU AEB Cyclist'!D57,1)","v":0}]
[null,"CBLA50 - rounded",{"$f":"ROUND('VRU AEB Cyclist'!D68,1)","v":0}]
[null,"CBLA25 - rounded",{"$f":"ROUND('VRU AEB Cyclist'!D78,1)","v":0}]
[null,"Total-rounded",{"$f":"ROUND('VRU AEB Cyclist'!D86,1)","v":0}]
[null,"Max points",9]
[null,null,{"$f":"'VRU AEB Cyclist'!D86/Datasheet!C269","v":0}]
[null,"AEB_Cyclist_Colour",{"$f":"IF(OR('General Overview'!E55=\"Not available\",'General Overview'!$E$55=\"Optional not meeting fitment\"),\"\",IF((C270)>=0.75,\"Green\",IF((C270)>=0.5,\"Yellow\",IF((C270)>=0.25,\"Orange\",IF((C270)>0,\"Brown\",\"Red\")))))","v":"Red"}]
[]
[]
[]
[null,"SAFETY ASSIST"]
[null,"SAS"]
[null,"rounded total",{"$f":"ROUND('SA SAS'!D49,1)","v":0},{"$f":"'SA SAS'!D49/Datasheet!C278","v":0}]
[null,"max points",3]
[null,"colour",{"$f":"IF(D277>=0.75,\"Green\",IF(D277>=0.5,\"Yellow\",IF(D277>=0.25,\"Orange\",IF(D277>0,\"Brown\",\"Red\"))))","v":"Red"}]
[null,"description",{"$f":"CONCATENATE('SA SAS'!D10,Datasheet!D280)","v":""},{"$f":"IF(OR('SA SAS'!D13:D22=\"Pass\"),\", subsigns supported\",\"\")","v":""}]
[null,"Accuracy",{"$f":"CONCATENATE('SA SAS'!D32,Datasheet!D281)","v":""},{"$f":"IF(AND('SA SAS'!D36<=5,'SA SAS'!D39<=5,'SA SAS'!D42<=5),\" (accurate to 5km/h)\",IF(AND('SA SAS'!D36<=10,'SA SAS'!D39<=10,'SA SAS'!D42<=10),\" (accurate to 10km/h)\",\"\"))","v":""}]
[]
[]
[null,"LSS"]
[null,"rounded total",{"$f":"ROUND('SA LSS'!D72,1)","v":0},{"$f":"'SA LSS'!D72/C286","v":0},null,null,null,null,null,null,null,null,null,null,null,10]
[null,"max points",4,null,null,null,null,null,null,null,null,null,null,null,null,{"$f":"P285+26.67","v":36.67}]
[null,"colour",{"$f":"IF(D285>=0.75,\"Green\",IF(D285>=0.5,\"Yellow\",IF(D285>=0.25,\"Orange\",IF(D285>0,\"Brown\",\"Red\"))))","v":"Red"},null,null,null,null,null,null,null,null,null,null,null,null,{"$f":"P286+26.67","v":63.34}]
[null,"ELK_rounded",{"$f":"ROUND('SA LSS'!D50,1)","v":0},null,null,null,null,null,null,null,null,null,null,null,null,{"$f":"P287+26.67","v":90.01}]
[null,"ELK_Max",3,{"$f":"'SA LSS'!D50/Datasheet!C289","v":0}]
[null,"ELK_colour",{"$f":"IF(D289>=0.75,\"Green\",IF(D289>=0.5,\"Yellow\",IF(D289>=0.25,\"Orange\",IF(D289>0,\"Brown\",\"Red\"))))","v":"Red"}]
[null,"LKA_rounded",{"$f":"ROUND('SA LSS'!D60,1)","v":0}]
[null,"LKA_Max",0.5]
[null,"LKA_colour",{"$f":"IF(C291=0.5,\"Green\",IF(C291=0.25,\"Orange\",\"Red\"))","v":"Red"}]
[null,"HMI_rounded",{"$f":"ROUND('SA LSS'!D65,1)","v":0}]
[null,"HMI_Max",0.5]
[null,"HMI_colour",{"$f":"IF(C294=0.5,\"Green\",IF(C294=0.25,\"Orange\",\"Red\"))","v":"Red"}]
[]
[null,null,null,null,null,null,0]
[null,null,null,null,null,null,1,"Autonomous emergency braking"]
[null,"AEB",null,null,null,null,2,"Forward collision warning"]
[null,"rounded_total",{"$f":"ROUND('SA AEB Car-to-Car'!D112,1)","v":0},null,null,null,3,"Autonomous emergency braking and forward collision warning"]
[null,"Max points",6,{"$f":"'SA AEB Car-to-Car'!D112/C302","v":0}]
[null,"colour",{"$f":"IF(D302>=0.75,\"Green\",IF(D302>=0.5,\"Yellow\",IF(D302>=0.25,\"Orange\",IF(D302>0,\"Brown\",\"Red\"))))","v":"Red"}]
[null,"additional information",{"$f":"VLOOKUP(F304,G304:H309,2)","v":"No supplementary warning or dynamic seatbelt retractors"},{"$f":"IF('SA AEB Car-to-Car'!D95=\"Yes\",1,0)","v":0},{"$f":"IF('SA AEB Car-to-Car'!D96=\"Yes\",2,0)","v":0},{"$f":"SUM(D304:E304)","v":0},0,"No supplementary warning or dynamic seatbelt retractors"]
[null,"min speed",{"$f":"MIN('SA AEB Car-to-Car'!D8,'SA AEB Car-to-Car'!I8)","v":0},{"$f":"IF('SA AEB Car-to-Car'!D7=\"Yes\",1,0)","v":0},{"$f":"IF('SA AEB Car-to-Car'!I7=\"Yes\",2,0)","v":0},{"$f":"SUM(D305:E305)","v":0},1,"Supplementary warning"]
[null,"functionality",{"$f":"IF(F305=0,\"\",VLOOKUP(F305,G299:H301,2))","v":""},{"$f":"C306","v":""}]
[null,"Sensors used","camera and radar",null,null,null,2,"Dynamic seatbelt retractors"]
[null,"CCRs"]
[null,"AEB colour LHS offset",{"$f":"IF(H328>=0.75,\"Green\",IF(H328>=0.5,\"Yellow\",IF(H328>=0.25,\"Orange\",IF(H328>0,\"Brown\",\"Red\"))))","v":{"$error":"#N/A"}},"Green",1,10,3,"Supplementary warning and dynamic seatbelt retractors"]
[null,"AEB colour Centreline",{"$f":"IF(J328>=0.75,\"Green\",IF(J328>=0.5,\"Yellow\",IF(J328>=0.25,\"Orange\",IF(J328>0,\"Brown\",\"Red\"))))","v":{"$error":"#N/A"}},"Yellow",0.75,15]
[null,"AEB colour RHS offset",{"$f":"IF(K328>=0.75,\"Green\",IF(K328>=0.5,\"Yellow\",IF(K328>=0.25,\"Orange\",IF(K328>0,\"Brown\",\"Red\"))))","v":{"$error":"#N/A"}},"Orange",0.5,20,"CCRs",null,null,null,null,null,null,null,null,null,null,null,null,null,null,null,null,null,null,null,null,"FCW"]
[null,"FCW colour LHS offset",{"$f":"IF(O328>=0.75,\"Green\",IF(O328>=0.5,\"Yellow\",IF(O328>=0.25,\"Orange\",IF(O328>0,\"Brown\",\"Red\"))))","v":{"$error":"#N/A"}},"Brown",0.25,25,"AEB",null,null,null,null,null,null,"FCW",null,null,null,null,null,"CCRm","AEB"]
[null,"FCW colour Centreline",{"$f":"IF(Q328>=0.75,\"Green\",IF(Q328>=0.5,\"Yellow\",IF(Q328>=0.25,\"Orange\",IF(Q328>0,\"Brown\",\"Red\"))))","v":{"$error":"#N/A"}},"Red",0,30,1,{"$f":"VLOOKUP('SA AEB Car-to-Car'!D18,$D$309:$E$313,2,0)*$G313","v":{"$error":"#N/A"}},{"$f":"VLOOKUP('SA AEB Car-to-Car'!E18,$D$309:$E$313,2,0)*$G313","v":{"$error":"#N/A"}},{"$f":"VLOOKUP('SA AEB Car-to-Car'!F18,$D$309:$E$313,2,0)*$G313","v":{"$error":"#N/A"}},{"$f":"VLOOKUP('SA AEB Car-to-Car'!G18,$D$309:$E$313,2,0)*$G313","v":{"$error":"#N/A"}},{"$f":"VLOOKUP('SA AEB Car-to-Car'!H18,$D$309:$E$313,2,0)*$G313","v":{"$error":"#N/A"}}]
[null,"FCW colour RHS offset",{"$f":"IF(R328>=0.75,\"Green\",IF(R328>=0.5,\"Yellow\",IF(R328>=0.25,\"Orange\",IF(R328>0,\"Brown\",\"Red\"))))","v":{"$error":"#N/A"}},null,null,35,2,{"$f":"VLOOKUP('SA AEB Car-to-Car'!D19,$D$309:$E$313,2,0)*$G314","v":{"$error":"#N/A"}},{"$f":"VLOOKUP('SA AEB Car-to-Car'!E19,$D$309:$E$313,2,0)*$G314","v":{"$error":"#N/A"}},{"$f":"VLOOKUP('SA AEB Car-to-Car'!F19,$D$309:$E$313,2,0)*$G314","v":{"$error":"#N/A"}},{"$f":"VLOOKUP('SA AEB Car-to-Car'!G19,$D$309:$E$313,2,0)*$G314","v":{"$error":"#N/A"}},{"$f":"VLOOKUP('SA AEB Car-to-Car'!H19,$D$309:$E$313,2,0)*$G314","v":{"$error":"#N/A"}}]
[null,"CCRm",null,null,null,40,2,{"$f":"VLOOKUP('SA AEB Car-to-Car'!D20,$D$309:$E$313,2,0)*$G315","v":{"$error":"#N/A"}},{"$f":"VLOOKUP('SA AEB Car-to-Car'!E20,$D$309:$E$313,2,0)*$G315","v":{"$error":"#N/A"}},{"$f":"VLOOKUP('SA AEB Car-to-Car'!F20,$D$309:$E$313,2,0)*$G315","v":{"$error":"#N/A"}},{"$f":"VLOOKUP('SA AEB Car-to-Car'!G20,$D$309:$E$313,2,0)*$G315","v":{"$error":"#N/A"}},{"$f":"VLOOKUP('SA AEB Car-to-Car'!H20,$D$309:$E$313,2,0)*$G315","v":{"$error":"#N/A"}}]
[null,"AEB colour LHS offset",{"$f":"IF(V328>=0.75,\"Green\",IF(V328>=0.5,\"Yellow\",IF(V328>=0.25,\"Orange\",IF(V328>0,\"Brown\",\"Red\"))))","v":{"$error":"#N/A"}},null,null,45,2,{"$f":"VLOOKUP('SA AEB Car-to-Car'!D21,$D$309:$E$313,2,0)*$G316","v":{"$error":"#N/A"}},{"$f":"VLOOKUP('SA AEB Car-to-Car'!E21,$D$309:$E$313,2,0)*$G316","v":{"$error":"#N/A"}},{"$f":"VLOOKUP('SA AEB Car-to-Car'!F21,$D$309:$E$313,2,0)*$G316","v":{"$error":"#N/A"}},{"$f":"VLOOKUP('SA AEB Car-to-Car'!G21,$D$309:$E$313,2,0)*$G316","v":{"$error":"#N/A"}},{"$f":"VLOOKUP('SA AEB Car-to-Car'!H21,$D$309:$E$313,2,0)*$G316","v":{"$error":"#N/A"}},null,null,null,null,null,null,null,null,null,null,null,null,null,{"$f":"VLOOKUP('SA AEB Car-to-Car'!H36,$D$309:$E$313,2,0)*$U317","v":{"$error":"#N/A"}}]
[null,"AEB colour Centreline",{"$f":"IF(X328>=0.75,\"Green\",IF(X328>=0.5,\"Yellow\",IF(X328>=0.25,\"Orange\",IF(X328>0,\"Brown\",\"Red\"))))","v":{"$error":"#N/A"}},null,null,50,2,{"$f":"VLOOKUP('SA AEB Car-to-Car'!D22,$D$309:$E$313,2,0)*$G317","v":{"$error":"#N/A"}},{"$f":"VLOOKUP('SA AEB Car-to-Car'!E22,$D$309:$E$313,2,0)*$G317","v":{"$error":"#N/A"}},{"$f":"VLOOKUP('SA AEB Car-to-Car'!F22,$D$309:$E$313,2,0)*$G317","v":{"$error":"#N/A"}},{"$f":"VLOOKUP('SA AEB Car-to-Car'!G22,$D$309:$E$313,2,0)*$G317","v":{"$error":"#N/A"}},{"$f":"VLOOKUP('SA AEB Car-to-Car'!H22,$D$309:$E$313,2,0)*$G317","v":{"$error":"#N/A"}},null,2,{"$f":"VLOOKUP('SA AEB Car-to-Car'!I22,$D$309:$E$313,2,0)*$N317","v":{"$error":"#N/A"}},{"$f":"VLOOKUP('SA AEB Car-to-Car'!J22,$D$309:$E$313,2,0)*$N317","v":{"$error":"#N/A"}},{"$f":"VLOOKUP('SA AEB Car-to-Car'!K22,$D$309:$E$313,2,0)*$N317","v":{"$error":"#N/A"}},{"$f":"VLOOKUP('SA AEB Car-to-Car'!L22,$D$309:$E$313,2,0)*$N317","v":{"$error":"#N/A"}},{"$f":"VLOOKUP('SA AEB Car-to-Car'!M22,$D$309:$E$313,2,0)*$N317","v":{"$error":"#N/A"}},null,1,{"$f":"VLOOKUP('SA AEB Car-to-Car'!D36,$D$309:$E$313,2,0)*$U317","v":{"$error":"#N/A"}},{"$f":"VLOOKUP('SA AEB Car-to-Car'!E36,$D$309:$E$313,2,0)*$U317","v":{"$error":"#N/A"}},{"$f":"VLOOKUP('SA AEB Car-to-Car'!F36,$D$309:$E$313,2,0)*$U317","v":{"$error":"#N/A"}},{"$f":"VLOOKUP('SA AEB Car-to-Car'!G36,$D$309:$E$313,2,0)*$U317","v":{"$error":"#N/A"}},{"$f":"VLOOKUP('SA AEB Car-to-Car'!H37,$D$309:$E$313,2,0)*$U318","v":{"$error":"#N/A"}}]
[null,"AEB colour RHS offset",{"$f":"IF(Y328>=0.75,\"Green\",IF(Y328>=0.5,\"Yellow\",IF(Y328>=0.25,\"Orange\",IF(Y328>0,\"Brown\",\"Red\"))))","v":{"$error":"#N/A"}},null,null,55,2,{"$f":"VLOOKUP('SA AEB Car-to-Car'!D23,$D$309:$E$313,2,0)*$G318","v":{"$error":"#N/A"}},{"$f":"VLOOKUP('SA AEB Car-to-Car'!E23,$D$309:$E$313,2,0)*$G318","v":{"$error":"#N/A"}},{"$f":"VLOOKUP('SA AEB Car-to-Car'!F23,$D$309:$E$313,2,0)*$G318","v":{"$error":"#N/A"}},{"$f":"VLOOKUP('SA AEB Car-to-Car'!G23,$D$309:$E$313,2,0)*$G318","v":{"$error":"#N/A"}},{"$f":"VLOOKUP('SA AEB Car-to-Car'!H23,$D$309:$E$313,2,0)*$G318","v":{"$error":"#N/A"}},null,2,{"$f":"VLOOKUP('SA AEB Car-to-Car'!I23,$D$309:$E$313,2,0)*$N318","v":{"$error":"#N/A"}},{"$f":"VLOOKUP('SA AEB Car-to-Car'!J23,$D$309:$E$313,2,0)*$N318","v":{"$error":"#N/A"}},{"$f":"VLOOKUP('SA AEB Car-to-Car'!K23,$D$309:$E$313,2,0)*$N318","v":{"$error":"#N/A"}},{"$f":"VLOOKUP('SA AEB Car-to-Car'!L23,$D$309:$E$313,2,0)*$N318","v":{"$error":"#N/A"}},{"$f":"VLOOKUP('SA AEB Car-to-Car'!M23,$D$309:$E$313,2,0)*$N318","v":{"$error":"#N/A"}},null,1,{"$f":"VLOOKUP('SA AEB Car-to-Car'!D37,$D$309:$E$313,2,0)*$U318","v":{"$error":"#N/A"}},{"$f":"VLOOKUP('SA AEB Car-to-Car'!E37,$D$309:$E$313,2,0)*$U318","v":{"$error":"#N/A"}},{"$f":"VLOOKUP('SA AEB Car-to-Car'!F37,$D$309:$E$313,2,0)*$U318","v":{"$error":"#N/A"}},{"$f":"VLOOKUP('SA AEB Car-to-Car'!G37,$D$309:$E$313,2,0)*$U318","v":{"$error":"#N/A"}},{"$f":"VLOOKUP('SA AEB Car-to-Car'!H38,$D$309:$E$313,2,0)*$U319","v":{"$error":"#N/A"}}]
[null,"FCW colour LHS offset",{"$f":"IF(AC327>=0.75,\"Green\",IF(AC327>=0.5,\"Yellow\",IF(AC327>=0.25,\"Orange\",IF(AC327>0,\"Brown\",\"Red\"))))","v":{"$error":"#N/A"}},null,null,60,1,{"$f":"VLOOKUP('SA AEB Car-to-Car'!D24,$D$309:$E$313,2,0)*$G319","v":{"$error":"#N/A"}},{"$f":"VLOOKUP('SA AEB Car-to-Car'!E24,$D$309:$E$313,2,0)*$G319","v":{"$error":"#N/A"}},{"$f":"VLOOKUP('SA AEB Car-to-Car'!F24,$D$309:$E$313,2,0)*$G319","v":{"$error":"#N/A"}},{"$f":"VLOOKUP('SA AEB Car-to-Car'!G24,$D$309:$E$313,2,0)*$G319","v":{"$error":"#N/A"}},{"$f":"VLOOKUP('SA AEB Car-to-Car'!H24,$D$309:$E$313,2,0)*$G319","v":{"$error":"#N/A"}},null,2,{"$f":"VLOOKUP('SA AEB Car-to-Car'!I24,$D$309:$E$313,2,0)*$N319","v":{"$error":"#N/A"}},{"$f":"VLOOKUP('SA AEB Car-to-Car'!J24,$D$309:$E$313,2,0)*$N319","v":{"$error":"#N/A"}},{"$f":"VLOOKUP('SA AEB Car-to-Car'!K24,$D$309:$E$313,2,0)*$N319","v":{"$error":"#N/A"}},{"$f":"VLOOKUP('SA AEB Car-to-Car'!L24,$D$309:$E$313,2,0)*$N319","v":{"$error":"#N/A"}},{"$f":"VLOOKUP('SA AEB Car-to-Car'!M24,$D$309:$E$313,2,0)*$N319","v":{"$error":"#N/A"}},null,1,{"$f":"VLOOKUP('SA AEB Car-to-Car'!D38,$D$309:$E$313,2,0)*$U319","v":{"$error":"#N/A"}},{"$f":"VLOOKUP('SA AEB Car-to-Car'!E38,$D$309:$E$313,2,0)*$U319","v":{"$error":"#N/A"}},{"$f":"VLOOKUP('SA AEB Car-to-Car'!F38,$D$309:$E$313,2,0)*$U319","v":{"$error":"#N/A"}},{"$f":"VLOOKUP('SA AEB Car-to-Car'!G38,$D$309:$E$313,2,0)*$U319","v":{"$error":"#N/A"}},{"$f":"VLOOKUP('SA AEB Car-to-Car'!H39,$D$309:$E$313,2,0)*$U320","v":{"$error":"#N/A"}}]
[null,"FCW colour Centreline",{"$f":"IF(AE327>=0.75,\"Green\",IF(AE327>=0.5,\"Yellow\",IF(AE327>=0.25,\"Orange\",IF(AE327>0,\"Brown\",\"Red\"))))","v":{"$error":"#N/A"}},null,null,65,1,{"$f":"VLOOKUP('SA AEB Car-to-Car'!D25,$D$309:$E$313,2,0)*$G320","v":{"$error":"#N/A"}},{"$f":"VLOOKUP('SA AEB Car-to-Car'!E25,$D$309:$E$313,2,0)*$G320","v":{"$error":"#N/A"}},{"$f":"VLOOKUP('SA AEB Car-to-Car'!F25,$D$309:$E$313,2,0)*$G320","v":{"$error":"#N/A"}},{"$f":"VLOOKUP('SA AEB Car-to-Car'!G25,$D$309:$E$313,2,0)*$G320","v":{"$error":"#N/A"}},{"$f":"VLOOKUP('SA AEB Car-to-Car'!H25,$D$309:$E$313,2,0)*$G320","v":{"$error":"#N/A"}},null,2,{"$f":"VLOOKUP('SA AEB Car-to-Car'!I25,$D$309:$E$313,2,0)*$N320","v":{"$error":"#N/A"}},{"$f":"VLOOKUP('SA AEB Car-to-Car'!J25,$D$309:$E$313,2,0)*$N320","v":{"$error":"#N/A"}},{"$f":"VLOOKUP('SA AEB Car-to-Car'!K25,$D$309:$E$313,2,0)*$N320","v":{"$error":"#N/A"}},{"$f":"VLOOKUP('SA AEB Car-to-Car'!L25,$D$309:$E$313,2,0)*$N320","v":{"$error":"#N/A"}},{"$f":"VLOOKUP('SA AEB Car-to-Car'!M25,$D$309:$E$313,2,0)*$N320","v":{"$error":"#N/A"}},null,1,{"$f":"VLOOKUP('SA AEB Car-to-Car'!D39,$D$309:$E$313,2,0)*$U320","v":{"$error":"#N/A"}},{"$f":"VLOOKUP('SA AEB Car-to-Car'!E39,$D$309:$E$313,2,0)*$U320","v":{"$error":"#N/A"}},{"$f":"VLOOKUP('SA AEB Car-to-Car'!F39,$D$309:$E$313,2,0)*$U320","v":{"$error":"#N/A"}},{"$f":"VLOOKUP('SA AEB Car-to-Car'!G39,$D$309:$E$313,2,0)*$U320","v":{"$error":"#N/A"}},{"$f":"VLOOKUP('SA AEB Car-to-Car'!H40,$D$309:$E$313,2,0)*$U321","v":{"$error":"#N/A"}},null,1,{"$f":"VLOOKUP('SA AEB Car-to-Car'!I40,$D$309:$E$313,2,0)*$AB320","v":{"$error":"#N/A"}},{"$f":"VLOOKUP('SA AEB Car-to-Car'!J40,$D$309:$E$313,2,0)*$AB320","v":{"$error":"#N/A"}},{"$f":"VLOOKUP('SA AEB Car-to-Car'!K40,$D$309:$E$313,2,0)*$AB320","v":{"$error":"#N/A"}},{"$f":"VLOOKUP('SA AEB Car-to-Car'!L40,$D$309:$E$313,2,0)*$AB320","v":{"$error":"#N/A"}},{"$f":"VLOOKUP('SA AEB Car-to-Car'!M40,$D$309:$E$313,2,0)*$AB320","v":{"$error":"#N/A"}}]
[null,"FCW colour RHS offset",{"$f":"IF(AF327>=0.75,\"Green\",IF(AF327>=0.5,\"Yellow\",IF(AF327>=0.25,\"Orange\",IF(AF327>0,\"Brown\",\"Red\"))))","v":{"$error":"#N/A"}},null,null,70,1,{"$f":"VLOOKUP('SA AEB Car-to-Car'!D26,$D$309:$E$313,2,0)*$G321","v":{"$error":"#N/A"}},{"$f":"VLOOKUP('SA AEB Car-to-Car'!E26,$D$309:$E$313,2,0)*$G321","v":{"$error":"#N/A"}},{"$f":"VLOOKUP('SA AEB Car-to-Car'!F26,$D$309:$E$313,2,0)*$G321","v":{"$error":"#N/A"}},{"$f":"VLOOKUP('SA AEB Car-to-Car'!G26,$D$309:$E$313,2,0)*$G321","v":{"$error":"#N/A"}},{"$f":"VLOOKUP('SA AEB Car-to-Car'!H26,$D$309:$E$313,2,0)*$G321","v":{"$error":"#N/A"}},null,3,{"$f":"VLOOKUP('SA AEB Car-to-Car'!I26,$D$309:$E$313,2,0)*$N321","v":{"$error":"#N/A"}},{"$f":"VLOOKUP('SA AEB Car-to-Car'!J26,$D$309:$E$313,2,0)*$N321","v":{"$error":"#N/A"}},{"$f":"VLOOKUP('SA AEB Car-to-Car'!K26,$D$309:$E$313,2,0)*$N321","v":{"$error":"#N/A"}},{"$f":"VLOOKUP('SA AEB Car-to-Car'!L26,$D$309:$E$313,2,0)*$N321","v":{"$error":"#N/A"}},{"$f":"VLOOKUP('SA AEB Car-to-Car'!M26,$D$309:$E$313,2,0)*$N321","v":{"$error":"#N/A"}},null,1,{"$f":"VLOOKUP('SA AEB Car-to-Car'!D40,$D$309:$E$313,2,0)*$U321","v":{"$error":"#N/A"}},{"$f":"VLOOKUP('SA AEB Car-to-Car'!E40,$D$309:$E$313,2,0)*$U321","v":{"$error":"#N/A"}},{"$f":"VLOOKUP('SA AEB Car-to-Car'!F40,$D$309:$E$313,2,0)*$U321","v":{"$error":"#N/A"}},{"$f":"VLOOKUP('SA AEB Car-to-Car'!G40,$D$309:$E$313,2,0)*$U321","v":{"$error":"#N/A"}},{"$f":"VLOOKUP('SA AEB Car-to-Car'!H41,$D$309:$E$313,2,0)*$U322","v":{"$error":"#N/A"}},null,1,{"$f":"VLOOKUP('SA AEB Car-to-Car'!I41,$D$309:$E$313,2,0)*$AB321","v":{"$error":"#N/A"}},{"$f":"VLOOKUP('SA AEB Car-to-Car'!J41,$D$309:$E$313,2,0)*$AB321","v":{"$error":"#N/A"}},{"$f":"VLOOKUP('SA AEB Car-to-Car'!K41,$D$309:$E$313,2,0)*$AB321","v":{"$error":"#N/A"}},{"$f":"VLOOKUP('SA AEB Car-to-Car'!L41,$D$309:$E$313,2,0)*$AB321","v":{"$error":"#N/A"}},{"$f":"VLOOKUP('SA AEB Car-to-Car'!M41,$D$309:$E$313,2,0)*$AB321","v":{"$error":"#N/A"}}]
[null,"CCRb",null,null,null,75,null,null,null,null,null,null,null,2,{"$f":"VLOOKUP('SA AEB Car-to-Car'!I27,$D$309:$E$313,2,0)*$N322","v":{"$error":"#N/A"}},{"$f":"VLOOKUP('SA AEB Car-to-Car'!J27,$D$309:$E$313,2,0)*$N322","v":{"$error":"#N/A"}},{"$f":"VLOOKUP('SA AEB Car-to-Car'!K27,$D$309:$E$313,2,0)*$N322","v":{"$error":"#N/A"}},{"$f":"VLOOKUP('SA AEB Car-to-Car'!L27,$D$309:$E$313,2,0)*$N322","v":{"$error":"#N/A"}},{"$f":"VLOOKUP('SA AEB Car-to-Car'!M27,$D$309:$E$313,2,0)*$N322","v":{"$error":"#N/A"}},null,1,{"$f":"VLOOKUP('SA AEB Car-to-Car'!D41,$D$309:$E$313,2,0)*$U322","v":{"$error":"#N/A"}},{"$f":"VLOOKUP('SA AEB Car-to-Car'!E41,$D$309:$E$313,2,0)*$U322","v":{"$error":"#N/A"}},{"$f":"VLOOKUP('SA AEB Car-to-Car'!F41,$D$309:$E$313,2,0)*$U322","v":{"$error":"#N/A"}},{"$f":"VLOOKUP('SA AEB Car-to-Car'!G41,$D$309:$E$313,2,0)*$U322","v":{"$error":"#N/A"}},{"$f":"VLOOKUP('SA AEB Car-to-Car'!H42,$D$309:$E$313,2,0)*$U323","v":{"$error":"#N/A"}},null,1,{"$f":"VLOOKUP('SA AEB Car-to-Car'!I42,$D$309:$E$313,2,0)*$AB322","v":{"$error":"#N/A"}},{"$f":"VLOOKUP('SA AEB Car-to-Car'!J42,$D$309:$E$313,2,0)*$AB322","v":{"$error":"#N/A"}},{"$f":"VLOOKUP('SA AEB Car-to-Car'!K42,$D$309:$E$313,2,0)*$AB322","v":{"$error":"#N/A"}},{"$f":"VLOOKUP('SA AEB Car-to-Car'!L42,$D$309:$E$313,2,0)*$AB322","v":{"$error":"#N/A"}},{"$f":"VLOOKUP('SA AEB Car-to-Car'!M42,$D$309:$E$313,2,0)*$AB322","v":{"$error":"#N/A"}}]
[null,"AEB colour Centreline",{"$f":"IF('SA AEB Car-to-Car'!D57>=0.75,\"Green\",IF('SA AEB Car-to-Car'!D57>=0.5,\"Yellow\",IF('SA AEB Car-to-Car'!D57>=0.25,\"Orange\",IF('SA AEB Car-to-Car'!D57>0,\"Brown\",\"Red\"))))","v":"Red"},null,null,80,null,null,null,null,null,null,null,1,{"$f":"VLOOKUP('SA AEB Car-to-Car'!I28,$D$309:$E$313,2,0)*$N323","v":{"$error":"#N/A"}},{"$f":"VLOOKUP('SA AEB Car-to-Car'!J28,$D$309:$E$313,2,0)*$N323","v":{"$error":"#N/A"}},{"$f":"VLOOKUP('SA AEB Car-to-Car'!K28,$D$309:$E$313,2,0)*$N323","v":{"$error":"#N/A"}},{"$f":"VLOOKUP('SA AEB Car-to-Car'!L28,$D$309:$E$313,2,0)*$N323","v":{"$error":"#N/A"}},{"$f":"VLOOKUP('SA AEB Car-to-Car'!M28,$D$309:$E$313,2,0)*$N323","v":{"$error":"#N/A"}},null,1,{"$f":"VLOOKUP('SA AEB Car-to-Car'!D42,$D$309:$E$313,2,0)*$U323","v":{"$error":"#N/A"}},{"$f":"VLOOKUP('SA AEB Car-to-Car'!E42,$D$309:$E$313,2,0)*$U323","v":{"$error":"#N/A"}},{"$f":"VLOOKUP('SA AEB Car-to-Car'!F42,$D$309:$E$313,2,0)*$U323","v":{"$error":"#N/A"}},{"$f":"VLOOKUP('SA AEB Car-to-Car'!G42,$D$309:$E$313,2,0)*$U323","v":{"$error":"#N/A"}},{"$f":"VLOOKUP('SA AEB Car-to-Car'!H43,$D$309:$E$313,2,0)*$U324","v":{"$error":"#N/A"}},null,2,{"$f":"VLOOKUP('SA AEB Car-to-Car'!I43,$D$309:$E$313,2,0)*$AB323","v":{"$error":"#N/A"}},{"$f":"VLOOKUP('SA AEB Car-to-Car'!J43,$D$309:$E$313,2,0)*$AB323","v":{"$error":"#N/A"}},{"$f":"VLOOKUP('SA AEB Car-to-Car'!K43,$D$309:$E$313,2,0)*$AB323","v":{"$error":"#N/A"}},{"$f":"VLOOKUP('SA AEB Car-to-Car'!L43,$D$309:$E$313,2,0)*$AB323","v":{"$error":"#N/A"}},{"$f":"VLOOKUP('SA AEB Car-to-Car'!M43,$D$309:$E$313,2,0)*$AB323","v":{"$error":"#N/A"}}]
[null,"FCW colour Centreline",{"$f":"IF('SA AEB Car-to-Car'!I57>=0.75,\"Green\",IF('SA AEB Car-to-Car'!I57>=0.5,\"Yellow\",IF('SA AEB Car-to-Car'!I57>=0.25,\"Orange\",IF('SA AEB Car-to-Car'!I57>0,\"Brown\",\"Red\"))))","v":"Red"},null,null,null,null,null,null,null,null,null,null,1,{"$f":"VLOOKUP('SA AEB Car-to-Car'!I29,$D$309:$E$313,2,0)*$N324","v":{"$error":"#N/A"}},{"$f":"VLOOKUP('SA AEB Car-to-Car'!J29,$D$309:$E$313,2,0)*$N324","v":{"$error":"#N/A"}},{"$f":"VLOOKUP('SA AEB Car-to-Car'!K29,$D$309:$E$313,2,0)*$N324","v":{"$error":"#N/A"}},{"$f":"VLOOKUP('SA AEB Car-to-Car'!L29,$D$309:$E$313,2,0)*$N324","v":{"$error":"#N/A"}},{"$f":"VLOOKUP('SA AEB Car-to-Car'!M29,$D$309:$E$313,2,0)*$N324","v":{"$error":"#N/A"}},null,2,{"$f":"VLOOKUP('SA AEB Car-to-Car'!D43,$D$309:$E$313,2,0)*$U324","v":{"$error":"#N/A"}},{"$f":"VLOOKUP('SA AEB Car-to-Car'!E43,$D$309:$E$313,2,0)*$U324","v":{"$error":"#N/A"}},{"$f":"VLOOKUP('SA AEB Car-to-Car'!F43,$D$309:$E$313,2,0)*$U324","v":{"$error":"#N/A"}},{"$f":"VLOOKUP('SA AEB Car-to-Car'!G43,$D$309:$E$313,2,0)*$U324","v":{"$error":"#N/A"}},{"$f":"VLOOKUP('SA AEB Car-to-Car'!H44,$D$309:$E$313,2,0)*$U325","v":{"$error":"#N/A"}},null,2,{"$f":"VLOOKUP('SA AEB Car-to-Car'!I44,$D$309:$E$313,2,0)*$AB324","v":{"$error":"#N/A"}},{"$f":"VLOOKUP('SA AEB Car-to-Car'!J44,$D$309:$E$313,2,0)*$AB324","v":{"$error":"#N/A"}},{"$f":"VLOOKUP('SA AEB Car-to-Car'!K44,$D$309:$E$313,2,0)*$AB324","v":{"$error":"#N/A"}},{"$f":"VLOOKUP('SA AEB Car-to-Car'!L44,$D$309:$E$313,2,0)*$AB324","v":{"$error":"#N/A"}},{"$f":"VLOOKUP('SA AEB Car-to-Car'!M44,$D$309:$E$313,2,0)*$AB324","v":{"$error":"#N/A"}}]
[null,null,null,null,null,null,null,null,null,null,null,null,null,1,{"$f":"VLOOKUP('SA AEB Car-to-Car'!I30,$D$309:$E$313,2,0)*$N325","v":{"$error":"#N/A"}},{"$f":"VLOOKUP('SA AEB Car-to-Car'!J30,$D$309:$E$313,2,0)*$N325","v":{"$error":"#N/A"}},{"$f":"VLOOKUP('SA AEB Car-to-Car'!K30,$D$309:$E$313,2,0)*$N325","v":{"$error":"#N/A"}},{"$f":"VLOOKUP('SA AEB Car-to-Car'!L30,$D$309:$E$313,2,0)*$N325","v":{"$error":"#N/A"}},{"$f":"VLOOKUP('SA AEB Car-to-Car'!M30,$D$309:$E$313,2,0)*$N325","v":{"$error":"#N/A"}},null,2,{"$f":"VLOOKUP('SA AEB Car-to-Car'!D44,$D$309:$E$313,2,0)*$U325","v":{"$error":"#N/A"}},{"$f":"VLOOKUP('SA AEB Car-to-Car'!E44,$D$309:$E$313,2,0)*$U325","v":{"$error":"#N/A"}},{"$f":"VLOOKUP('SA AEB Car-to-Car'!F44,$D$309:$E$313,2,0)*$U325","v":{"$error":"#N/A"}},{"$f":"VLOOKUP('SA AEB Car-to-Car'!G44,$D$309:$E$313,2,0)*$U325","v":{"$error":"#N/A"}},{"$f":"VLOOKUP('SA AEB Car-to-Car'!H45,$D$309:$E$313,2,0)*$U326","v":{"$error":"#N/A"}},null,2,{"$f":"VLOOKUP('SA AEB Car-to-Car'!I45,$D$309:$E$313,2,0)*$AB325","v":{"$error":"#N/A"}},{"$f":"VLOOKUP('SA AEB Car-to-Car'!J45,$D$309:$E$313,2,0)*$AB325","v":{"$error":"#N/A"}},{"$f":"VLOOKUP('SA AEB Car-to-Car'!K45,$D$309:$E$313,2,0)*$AB325","v":{"$error":"#N/A"}},{"$f":"VLOOKUP('SA AEB Car-to-Car'!L45,$D$309:$E$313,2,0)*$AB325","v":{"$error":"#N/A"}},{"$f":"VLOOKUP('SA AEB Car-to-Car'!M45,$D$309:$E$313,2,0)*$AB325","v":{"$error":"#N/A"}}]
[null,null,null,null,null,null,null,null,null,null,null,null,null,1,{"$f":"VLOOKUP('SA AEB Car-to-Car'!I31,$D$309:$E$313,2,0)*$N326","v":{"$error":"#N/A"}},{"$f":"VLOOKUP('SA AEB Car-to-Car'!J31,$D$309:$E$313,2,0)*$N326","v":{"$error":"#N/A"}},{"$f":"VLOOKUP('SA AEB Car-to-Car'!K31,$D$309:$E$313,2,0)*$N326","v":{"$error":"#N/A"}},{"$f":"VLOOKUP('SA AEB Car-to-Car'!L31,$D$309:$E$313,2,0)*$N326","v":{"$error":"#N/A"}},{"$f":"VLOOKUP('SA AEB Car-to-Car'!M31,$D$309:$E$313,2,0)*$N326","v":{"$error":"#N/A"}},null,2,{"$f":"VLOOKUP('SA AEB Car-to-Car'!D45,$D$309:$E$313,2,0)*$U326","v":{"$error":"#N/A"}},{"$f":"VLOOKUP('SA AEB Car-to-Car'!E45,$D$309:$E$313,2,0)*$U326","v":{"$error":"#N/A"}},{"$f":"VLOOKUP('SA AEB Car-to-Car'!F45,$D$309:$E$313,2,0)*$U326","v":{"$error":"#N/A"}},{"$f":"VLOOKUP('SA AEB Car-to-Car'!G45,$D$309:$E$313,2,0)*$U326","v":{"$error":"#N/A"}},{"$f":"VLOOKUP('SA AEB Car-to-Car'!H46,$D$309:$E$313,2,0)*$U327","v":{"$error":"#N/A"}},null,2,{"$f":"VLOOKUP('SA AEB Car-to-Car'!I46,$D$309:$E$313,2,0)*$AB326","v":{"$error":"#N/A"}},{"$f":"VLOOKUP('SA AEB Car-to-Car'!J46,$D$309:$E$313,2,0)*$AB326","v":{"$error":"#N/A"}},{"$f":"VLOOKUP('SA AEB Car-to-Car'!K46,$D$309:$E$313,2,0)*$AB326","v":{"$error":"#N/A"}},{"$f":"VLOOKUP('SA AEB Car-to-Car'!L46,$D$309:$E$313,2,0)*$AB326","v":{"$error":"#N/A"}},{"$f":"VLOOKUP('SA AEB Car-to-Car'!M46,$D$309:$E$313,2,0)*$AB326","v":{"$error":"#N/A"}}]
[null,"CCFtap rounded",{"$f":"'SA AEB Car-to-Car'!D91*2","v":0},null,null,null,null,null,null,null,null,null,null,1,{"$f":"VLOOKUP('SA AEB Car-to-Car'!I32,$D$309:$E$313,2,0)*$N327","v":{"$error":"#N/A"}},{"$f":"VLOOKUP('SA AEB Car-to-Car'!J32,$D$309:$E$313,2,0)*$N327","v":{"$error":"#N/A"}},{"$f":"VLOOKUP('SA AEB Car-to-Car'!K32,$D$309:$E$313,2,0)*$N327","v":{"$error":"#N/A"}},{"$f":"VLOOKUP('SA AEB Car-to-Car'!L32,$D$309:$E$313,2,0)*$N327","v":{"$error":"#N/A"}},{"$f":"VLOOKUP('SA AEB Car-to-Car'!M32,$D$309:$E$313,2,0)*$N327","v":{"$error":"#N/A"}},null,2,{"$f":"VLOOKUP('SA AEB Car-to-Car'!D46,$D$309:$E$313,2,0)*$U327","v":{"$error":"#N/A"}},{"$f":"VLOOKUP('SA AEB Car-to-Car'!E46,$D$309:$E$313,2,0)*$U327","v":{"$error":"#N/A"}},{"$f":"VLOOKUP('SA AEB Car-to-Car'!F46,$D$309:$E$313,2,0)*$U327","v":{"$error":"#N/A"}},{"$f":"VLOOKUP('SA AEB Car-to-Car'!G46,$D$309:$E$313,2,0)*$U327","v":{"$error":"#N/A"}},null,null,null,{"$f":"SUM(AC320:AD326)/(2*SUM($AB$320:$AB$326))","v":{"$error":"#N/A"}},null,{"$f":"SUM(AE320:AE326)/(SUM($AB$320:$AB$326))","v":{"$error":"#N/A"}},{"$f":"SUM(AF320:AG326)/(2*SUM($AB$320:$AB$326))","v":{"$error":"#N/A"}}]
[null,"CCFtap Max points","2",{"$f":"C327/C328","v":0},null,null,null,{"$f":"SUM(H313:I321)/(2*SUM($G$313:$G$321))","v":{"$error":"#N/A"}},null,{"$f":"SUM(J313:J321)/(SUM($G$313:$G$321))","v":{"$error":"#N/A"}},{"$f":"SUM(K313:L321)/(2*SUM($G$313:$G$321))","v":{"$error":"#N/A"}},null,null,null,{"$f":"SUM(O317:P327)/(2*SUM($N$317:$N$327))","v":{"$error":"#N/A"}},null,{"$f":"SUM(Q317:Q327)/(SUM($N$317:$N$327))","v":{"$error":"#N/A"}},{"$f":"SUM(R317:S327)/(2*SUM($N$317:$N$327))","v":{"$error":"#N/A"}},null,null,null,{"$f":"SUM(V317:W327)/(2*SUM($U$317:$U$327))","v":{"$error":"#N/A"}},null,{"$f":"SUM(X317:X327)/(SUM($U$317:$U$327))","v":{"$error":"#N/A"}},{"$f":"SUM(Y316:Z326)/(2*SUM($U$317:$U$327))","v":{"$error":"#N/A"}}]
[null,"CCFtap - Colour",{"$f":"IF(D328>=0.75,\"Green\",IF(D328>=0.5,\"Yellow\",IF(D328>=0.25,\"Orange\",IF(D328>0,\"Brown\",\"Red\"))))","v":"Red"}]
[]
[]
[]
[]
[]
[]
[]
[null,"OSM"]
[null,"colour",{"$f":"IF(D338>0.75,\"Green\",IF(D338>0.5,\"Yellow\",IF(D338>0.25,\"Orange\",IF(D338>0,\"Brown\",\"Red\"))))","v":"Red"},{"$f":"'SA OSM'!D20/C340","v":0}]
[null,"rounded_total_OSM",{"$f":"ROUND('SA OSM'!D20,1)","v":0}]
[null,"MAX_points_OSM",3]
[null,"SBR_applies to",{"$f":"VLOOKUP(G341,I341:J345,2)","v":"Front and rear seats"},{"$f":"IF(AND('General Overview'!E60:F60=\"Standard\"),1,0)","v":0},{"$f":"IF('General Overview'!G60=\"standard\",2,0)","v":0},{"$f":"IF('General Overview'!H60=\"standard\",4,0)","v":4},{"$f":"SUM(D341:F341)","v":4},null,0,"No seats"]
[null,"SBR_rounded_total",{"$f":"ROUND('SA OSM'!D17,1)","v":0},null,null,null,null,null,1,"Front seats only"]
[null,"SBR_Max",2,null,null,null,null,null,3,"Front and rear seats"]
[null,"SBR_Colour",{"$f":"IF('SA OSM'!D17=2,\"Green\",IF('SA OSM'!D17>=1.5,\"Yellow\",IF('SA OSM'!D17>=1,\"Orange\",IF('SA OSM'!D17>=0.5,\"Brown\",IF('SA OSM'!D17>=0,\"Red\",\"\")))))","v":"Red"},null,null,null,null,null,5,{"$f":"CONCATENATE(\"Front and \",IF('General Overview'!E18=\"Optional\",\"optional \",\"\"),\"third row seats\")","v":"Front and third row seats"}]
[null,"Driver_Monitoring_rounded",{"$f":"ROUND('SA OSM'!D18,1)","v":0},null,null,null,null,null,7,{"$f":"CONCATENATE(\"Front and rear seats, including \",IF('General Overview'!E18=\"Optional\",\"optional \",\"\"),\"third row\")","v":"Front and rear seats, including third row"}]
[null,"Driver_monitoring_MAX","1"]
["---->>","Driver_monitoring_colour","Green"]
["---->>","Dr Monitor Name","Driver_Check"]
["---->>","Type","Direct eye monitoring"]
["---->>","Min Speed",30]